{"text_format":"3","workbook":"xlsx","n_sheets":4,"sheets":["2026","Kategorie - UPRAV ROK!","Pokyny","Časy cíl"],"not_rendered":{"macros":1,"external_links":1,"defined_names":4,"comments":1},"read":"whole","date_system":"1900"}

{"sheet":"2026","index":0,"n_rows":481,"n_cols":15,"rows_kept":481}
[]
["Kategorie 3-11 budou rozděleny na muže a ženy, ve věkových skupinách:"]
[{"$f":"'Kategorie - UPRAV ROK!'!D18","v":"1. do 2022   NADĚJE"}]
[{"$f":"'Kategorie - UPRAV ROK!'!D19","v":"2. 2020 - 2021   PŘEDŽÁCI"}]
[{"$f":"'Kategorie - UPRAV ROK!'!D20","v":"3. 2018 - 2019   MLADŠÍ ŽÁCI"},{"$nulls":3},"m","muži / chlapci"]
[{"$f":"'Kategorie - UPRAV ROK!'!D21","v":"4. 2016 - 2017   ŽÁCI"},{"$nulls":3},"z","ženy / dívky"]
[{"$f":"'Kategorie - UPRAV ROK!'!D22","v":"5. 2014 - 2015   STARŠÍ ŽÁCI"},{"$nulls":3},"hm","horolezci"]
[{"$f":"'Kategorie - UPRAV ROK!'!D23","v":"6. 2012 - 2013   MLADŠÍ DOROST"},{"$nulls":3},"hz","horolezkyně"]
[{"$f":"'Kategorie - UPRAV ROK!'!D24","v":"7. 2009 - 2011   STARŠÍ DOROST"}]
[{"$f":"'Kategorie - UPRAV ROK!'!D25","v":"8. 1986 - 2008   DOSPĚLÍ"}]
[{"$f":"'Kategorie - UPRAV ROK!'!D26","v":"9. 1985 - a starší   VETERÁNI"}]
[{"$f":"'Kategorie - UPRAV ROK!'!D27","v":"10. 1986 - 2008   HOROLEZCI"}]
[{"$f":"'Kategorie - UPRAV ROK!'!D28","v":"11. 1985 - a starší   HOROLEZCI VETERÁNI"}]
[{"$nulls":13},"10:00:00","Hodina startu - doplnit (např. start od 10:15 - doplň 10:00:00 a do Čas startu napiš 15)"]
[]
["Andrlíková Iva",1977,"hz"]
["Bajtlerová Nikola",2017,"z"]
["Bakoš Viktor",1978,"m"]
["Bareš Eduard",1995,"m"]
["Blažek Martin",1969,"m"]
["Brzobohatý Jindřich",2020,"m"]
["Brzobohatý Tomáš",1990,"hm"]
["Burget Lukáš",1985,"m"]
["Burget Maxim",2012,"m"]
["Cicvárek Jakub",1977,"hm"]
["Drbohlav Tomáš",1977,"m"]
["Dvořák David",1982,"m"]
["Dvořák Jonáš",2017,"m"]
["Dvořáková Nicol",2015,"z"]
["Erbertová Štěpánnka",2000,"z"]
["Faltová Anna",1998,"hz"]
["Fantová Lenka",1983,"z"]
["Filipová Adriana",2017,"z"]
["Formánek Dominik",2013,"m"]
["Gál Tomáš",1993,"m"]
["Gável Luboš",1984,"hm"]
["Gávelová Petra",1988,"hz"]
["Grolmus Miloslav",1982,"m"]
["Grolmusová Eliška",1988,"z"]
["Hájek Adam",2017,"m"]
["Hájek Antonín",2020,"m"]
["Hájek Jan",1985,"m"]
["Hájek Petr",1987,"m"]
["Hájková Eva",2017,"z"]
["Hájková Hana",2020,"z"]
["Hataš David",2008,"m"]
["Hataš Jan",1976,"m"]
["Hataš Tomáš",2010,"m"]
["Havelka Martin",2016,"m"]
["Havelka Martínek",2016,"m"]
["Havelka Petr",1979,"hm"]
["Havelka Šimon",2018,"m"]
["Havelka Šimonek",2018,"m"]
["Hermanová Pavlína",1998,"z"]
["Hisler Adam",2007,"m"]
["Hisler Radek",2004,"m"]
["Hladíková Eva",1997,"z"]
["Hluchý Antonín",2010,"m"]
["Hluchý Jan",1973,"hm"]
["Hluchý Max",2007,"m"]
["Hnilička Martin",1981,"m"]
["Hoffreiter Matyáš",2015,"m"]
["Hofreiter Matyáš",2015,"m"]
["Holetová Lenka",1983,"hz"]
["Holetová Lenka ",1983,"hz"]
["Horák Jan",1974,"m"]
["Horák Michal",2001,"m"]
["Horáková Zuzana",2003,"z"]
["Hrudka Ondřej",1992,"hm"]
["Hrudková Jana",1989,"hz"]
["Hrůša Ondřej",1987,"m"]
["Chadanič Ondřej",1979,"m"]
["Chlumská Veronika",1986,"z"]
["Chmelík Antonín",2010,"m"]
["Chmelík Miroslav",1980,"m"]
["Chmelíková Anna",2012,"z"]
["Chmelíková Karolína",1980,"z"]
["Chodanič Ondřej",1979,"m"]
["Chodaničová Eliška",2010,"z"]
["Chodaničová Zuzana",2006,"z"]
["Janoušková Šárka",1995,"z"]
["Jílková Helena",2019,"z"]
["Jílková Helenka",2019,"z"]
["Jirčík Tomáš",1996,"m"]
["Jirčíková Dáša",2014,"z"]
["Jirčíková Ema",2012,"z"]
["Jonášková Anička",2016,"z"]
["Jonášková Míša",2021,"z"]
["Jonášová Anička",2016,"z"]
["Jonášová Anna",2016,"z"]
["Kalaš Kryštov",2007,"m"]
["Karbanová Anička",2016,"z"]
["Kautzký Tomáš",1976,"m"]
["Kecer Ruda",1976,"m"]
["Kecer Rudolf",1976,"m"]
["Knoblochová Kamila",1983,"z"]
["Kohoutová Veronika",2007,"z"]
["Kolín Jakub",2002,"m"]
["Kolín Jaroslav",1972,"m"]
["Kolínoná Michaela",1979,"z"]
["Kopa Jaroslav",1987,"m"]
["Kortán Hermína",2021,"z"]
["Koťátková Laura",2010,"z"]
["Koťátková Linda",2008,"z"]
["Koťátková Věra",1978,"z"]
["Kotyk Jan",2001,"m"]
["Kotyková Nina",2004,"z"]
["Koudelková Alena",1975,"hz"]
["Koudelková Petra",1991,"z"]
["Krause Tadeáš ",2008,"m"]
["Kubín Lukáš",2011,"m"]
["Kučera Matěj ",2011,"m"]
["Kučera Štěpán",2014,"m"]
["Kuchta Michal",1995,"m"]
["Loupová Hana",1988,"z"]
["Madecký Lukáš",1990,"m"]
["Majdloch Albert",2013,"m"]
["Majdloch Matyáš",2011,"m"]
["Majdloch Tomáš",1979,"m"]
["Majdlochová Apolena",2017,"z"]
["Marhan Milan",1968,"hm"]
["Marková Majda",2016,"z"]
["Maruška Daniel",1980,"m"]
["Marušková Blanka",1979,"z"]
["Mašek Tadeáš",2000,"hm"]
["Matthissen Hana",1972,"z"]
["Mazuch Jiří",2016,"m"]
["Mazuch Kuba",2020,"m"]
["Mazuchová Vendula",1994,"hz"]
["Menzel Dan",1985,"m"]
["Menzel Kryštov",2019,"m"]
["Mikula Jan",2015,"m"]
["Mikula Jan ",1979,"hm"]
["Mikulová Dorka",2017,"z"]
["Mlčoch Bedřich",1994,"m"]
["Mlynářová Martina",1985,"z"]
["Nayperk Daniel",2015,"m"]
["Nezveda Viktor",2002,"m"]
["Novák Michal",1978,"m"]
["Novák Roman",1974,"m"]
["Novomestský Marcel",1985,"m"]
["Novotný Martin",2012,"m"]
["Paytoková Petra",1999,"z"]
["Peštová Simona",1988,"z"]
["Pfeiferová Nela",2012,"z"]
["Pfeiferová Tereza",2007,"z"]
["Podhajský Ondřej",2009,"m"]
["Podhajský Petr",1978,"hm"]
["Poslíšil Vítek",2010,"m"]
["Pospíšil Adam",2005,"m"]
["Pospíšil Jonáš",2013,"m"]
["Pospíšil Viktor",2003,"m"]
["Prýmková Iveta",1995,"z"]
["Ptáčková Radka",1971,"z"]
["Pulec Karel",1992,"m"]
["Rosecká Anežka",2016,"z"]
["Rosecký Michal",1973,"hm"]
["Rylich Vojtěch",1991,"m"]
["Semenský Martin",1987,"m"]
["Semenský Teodor",2019,"m"]
["Semerák Ivo",1976,"m"]
["Schnabl David",2005,"m"]
["Schnabl Jakub",2007,"m"]
["Schnabl Martin",1973,"m"]
["Schnabl Petr",1974,"m"]
["Schnabl Petr ml.",2008,"m"]
["Schnabl Prokop",2016,"m"]
["Schnabl Vít",2012,"m"]
["Schnablová Renata",1978,"z"]
["Slavík Jan",2019,"m"]
["Slavík Janek",2019,"m"]
["Slavík Kryštof",2915,"m"]
["Slavík Šimon",2012,"m"]
["Slavíková Anežka",2010,"z"]
["Slavíková Eliška",2010,"z"]
["Sofín Luděk",1971,"m"]
["Srnec Vladimír",1973,"m"]
["Steger Cyril",2001,"m"]
["Suchý Michal",1994,"m"]
["Svárovský David",1977,"hm"]
["Svárovský Janek",2010,"m"]
["Šedinová Kamila",1984,"z"]
["Šimánek Ladislav",1981,"hm"]
["Šimánková Monika",2012,"z"]
["Šlapák Miroslav",1976,"m"]
["Štafl Fanda",2015,"m"]
["Štafl Karel",1983,"m"]
["Štafl Matěj",2014,"m"]
["Štafl Štěpán",2012,"m"]
["Štafl Tonda",2013,"m"]
["Štafl Václav",1981,"m"]
["Štaflová Veronika",2017,"z"]
["Štejnar Radek",1980,"hm"]
["Štejnarová Adéla",2012,"z"]
["Štejnarová Eliška",2012,"z"]
["Štěpánek Libor",1980,"m"]
["Štěrba Jiří",2004,"m"]
["Štumf Ondřej",2018,"m"]
["Štumpf Jaroslav",1975,"hm"]
["Štumpf Ondřej",2018,"m"]
["Štumpfová Jasmína",2021,"z"]
["Šulcová Tereza",2000,"hz"]
["Švejda Jakub",2007,"m"]
["Tesař Roman",1990,"m"]
["Tesařová Eliška",2016,"z"]
["Tesařová Romanka",2018,"z"]
["Tišer Marek",2001,"m"]
["Tokarská Magdalena",1999,"z"]
["Toman Jan",1979,"hm"]
["Tomanová Anna",2009,"z"]
["Tomanová Rozálie",2013,"z"]
["Tuček Tomáš",2016,"m"]
["Tučková Alžběta",2016,"z"]
["Tučková Bětka",2016,"z"]
["Tvaroh Ondřej",2016,"m"]
["Tvarohová Renata",1994,"z"]
["Tvarová Renata",1994,"z"]
["Vancl Jan",1984,"m"]
["Veleba Matouš",2008,"m"]
["Velebová Kateřina",1976,"hz"]
["Vopat Václav",2020,"m"]
["Vytvar František",2011,"m"]
["Vytvar Jan",1986,"m"]
["Wiedeman Nicolas",2009,"m"]
["Wiedeman René",1973,"m"]
["Zavrtálek Petr",1984,"m"]
["Zelinka Maxmilián",2017,"m"]
["Zelinka Mikuláš",2016,"m"]
["Žula Peter",1990,"hm"]
["Příjmení, jméno","Rok nar."," m, z, hm, hz","Kategorie","St. Číslo","Čas start (minuty)","Čas start v hodinách","Čas cíl v hodinách","Čas","Pořadí v kat.","Č. sloupce ve vyhledávání kategorie - 1 až 4 znamená m, z, hm, hz","Modře označené sloupce nemazat - jsou v nich vzorce"]
["Filipová Mariana",2021,"z",{"$f":"IF(B231=\"\",\"\",VLOOKUP('[1]Kategorie - UPRAV ROK!'!$B$1-B231,'[1]Kategorie - UPRAV ROK!'!$A$5:$G$13,OFFSET(B231,0,9)+3,TRUE))","v":"1 - NADĚJE"},3,1,{"$f":"$N$14+F231/(60*24)","v":"10:01:00"},{"$f":"IF(ISERROR(VLOOKUP(E231,'Časy cíl'!$B$2:$C$252,2,FALSE)),\"\",VLOOKUP(E231,'Časy cíl'!$B$2:$C$252,2,FALSE))","v":"10:07:21"},{"$f":"IF(ISERROR(H231-G231),\"\",IF(H231=0,\"chybí čas\",H231-G231))","v":"00:06:21"},{"$f":"IF(D231=D230,J230+1,1)","v":1},{"$f":"VLOOKUP(C231,'Kategorie - UPRAV ROK!'!$A$18:$C$21,3,FALSE)","v":2}]
["Semenská Meda",2022,"z",{"$f":"IF(B232=\"\",\"\",VLOOKUP('Kategorie - UPRAV ROK!'!$B$1-B232,'Kategorie - UPRAV ROK!'!$A$5:$G$13,OFFSET(B232,0,9)+3,TRUE))","v":"1 - NADĚJE"},5,2,{"$f":"$N$14+F232/(60*24)","v":"10:02:00"},{"$f":"IF(ISERROR(VLOOKUP(E232,'Časy cíl'!$B$2:$C$252,2,FALSE)),\"\",VLOOKUP(E232,'Časy cíl'!$B$2:$C$252,2,FALSE))","v":"10:10:30"},{"$f":"IF(ISERROR(H232-G232),\"\",IF(H232=0,\"chybí čas\",H232-G232))","v":"00:08:30"},{"$f":"IF(D232=D231,J231+1,1)","v":2},{"$f":"VLOOKUP(C232,'Kategorie - UPRAV ROK!'!$A$18:$C$21,3,FALSE)","v":2}]
["Čečelská Sára",2023,"z",{"$f":"IF(B233=\"\",\"\",VLOOKUP('Kategorie - UPRAV ROK!'!$B$1-B233,'Kategorie - UPRAV ROK!'!$A$5:$G$13,OFFSET(B233,0,9)+3,TRUE))","v":"1 - NADĚJE"},2,1,{"$f":"$N$14+F233/(60*24)","v":"10:01:00"},{"$f":"IF(ISERROR(VLOOKUP(E233,'Časy cíl'!$B$2:$C$252,2,FALSE)),\"\",VLOOKUP(E233,'Časy cíl'!$B$2:$C$252,2,FALSE))","v":"10:10:09"},{"$f":"IF(ISERROR(H233-G233),\"\",IF(H233=0,\"chybí čas\",H233-G233))","v":"00:09:09"},{"$f":"IF(D233=D232,J232+1,1)","v":3},{"$f":"VLOOKUP(C233,'Kategorie - UPRAV ROK!'!$A$18:$C$21,3,FALSE)","v":2}]
["Holas Václav",2023,"m",{"$f":"IF(B234=\"\",\"\",VLOOKUP('Kategorie - UPRAV ROK!'!$B$1-B234,'Kategorie - UPRAV ROK!'!$A$5:$G$13,OFFSET(B234,0,9)+3,TRUE))","v":"1 - NADĚJE"},6,2,{"$f":"$N$14+F234/(60*24)","v":"10:02:00"},{"$f":"IF(ISERROR(VLOOKUP(E234,'Časy cíl'!$B$2:$C$252,2,FALSE)),\"\",VLOOKUP(E234,'Časy cíl'!$B$2:$C$252,2,FALSE))","v":"10:15:40"},{"$f":"IF(ISERROR(H234-G234),\"\",IF(H234=0,\"chybí čas\",H234-G234))","v":"00:13:40"},{"$f":"IF(D234=D233,J233+1,1)","v":4},{"$f":"VLOOKUP(C234,'Kategorie - UPRAV ROK!'!$A$18:$C$21,3,FALSE)","v":1}]
["Havelka Tobiáš",2023,"m",{"$f":"IF(B235=\"\",\"\",VLOOKUP('Kategorie - UPRAV ROK!'!$B$1-B235,'Kategorie - UPRAV ROK!'!$A$5:$G$13,OFFSET(B235,0,9)+3,TRUE))","v":"1 - NADĚJE"},4,2,{"$f":"$N$14+F235/(60*24)","v":"10:02:00"},{"$f":"IF(ISERROR(VLOOKUP(E235,'Časy cíl'!$B$2:$C$252,2,FALSE)),\"\",VLOOKUP(E235,'Časy cíl'!$B$2:$C$252,2,FALSE))","v":"10:17:49"},{"$f":"IF(ISERROR(H235-G235),\"\",IF(H235=0,\"chybí čas\",H235-G235))","v":"00:15:49"},{"$f":"IF(D235=D234,J234+1,1)","v":5},{"$f":"VLOOKUP(C235,'Kategorie - UPRAV ROK!'!$A$18:$C$21,3,FALSE)","v":1}]
["Brzobohatý Eduard",2024,"m",{"$f":"IF(B236=\"\",\"\",VLOOKUP('Kategorie - UPRAV ROK!'!$B$1-B236,'Kategorie - UPRAV ROK!'!$A$5:$G$13,OFFSET(B236,0,9)+3,TRUE))","v":"1 - NADĚJE"},1,1,{"$f":"$N$14+F236/(60*24)","v":"10:01:00"},{"$f":"IF(ISERROR(VLOOKUP(E236,'Časy cíl'!$B$2:$C$252,2,FALSE)),\"\",VLOOKUP(E236,'Časy cíl'!$B$2:$C$252,2,FALSE))","v":"10:18:24"},{"$f":"IF(ISERROR(H236-G236),\"\",IF(H236=0,\"chybí čas\",H236-G236))","v":"00:17:24"},{"$f":"IF(D236=D235,J235+1,1)","v":6},{"$f":"VLOOKUP(C236,'Kategorie - UPRAV ROK!'!$A$18:$C$21,3,FALSE)","v":1}]
["Šváb David",2022,"m",{"$f":"IF(B237=\"\",\"\",VLOOKUP('Kategorie - UPRAV ROK!'!$B$1-B237,'Kategorie - UPRAV ROK!'!$A$5:$G$13,OFFSET(B237,0,9)+3,TRUE))","v":"1 - NADĚJE"},null,null,{"$f":"$N$14+F237/(60*24)","v":"10:00:00"},{"$f":"IF(ISERROR(VLOOKUP(E237,'Časy cíl'!$B$2:$C$252,2,FALSE)),\"\",VLOOKUP(E237,'Časy cíl'!$B$2:$C$252,2,FALSE))","v":""},{"$f":"IF(ISERROR(H237-G237),\"\",IF(H237=0,\"chybí čas\",H237-G237))","v":""},{"$f":"IF(D237=D236,J236+1,1)","v":7},{"$f":"VLOOKUP(C237,'Kategorie - UPRAV ROK!'!$A$18:$C$21,3,FALSE)","v":1}]
["Brzobohatý Jindřich",2020,"m",{"$f":"IF(B238=\"\",\"\",VLOOKUP('Kategorie - UPRAV ROK!'!$B$1-B238,'Kategorie - UPRAV ROK!'!$A$5:$G$13,OFFSET(B238,0,9)+3,TRUE))","v":"2 - PŘEDŽÁCI"},7,3,{"$f":"$N$14+F238/(60*24)","v":"10:03:00"},{"$f":"IF(ISERROR(VLOOKUP(E238,'Časy cíl'!$B$2:$C$252,2,FALSE)),\"\",VLOOKUP(E238,'Časy cíl'!$B$2:$C$252,2,FALSE))","v":"10:08:14"},{"$f":"IF(ISERROR(H238-G238),\"\",IF(H238=0,\"chybí čas\",H238-G238))","v":"00:05:14"},{"$f":"IF(D238=D237,J237+1,1)","v":1},{"$f":"VLOOKUP(C238,'Kategorie - UPRAV ROK!'!$A$18:$C$21,3,FALSE)","v":1}]
["Vopat Václav",2020,"m",{"$f":"IF(B239=\"\",\"\",VLOOKUP('Kategorie - UPRAV ROK!'!$B$1-B239,'Kategorie - UPRAV ROK!'!$A$5:$G$13,OFFSET(B239,0,9)+3,TRUE))","v":"2 - PŘEDŽÁCI"},14,5,{"$f":"$N$14+F239/(60*24)","v":"10:05:00"},{"$f":"IF(ISERROR(VLOOKUP(E239,'Časy cíl'!$B$2:$C$252,2,FALSE)),\"\",VLOOKUP(E239,'Časy cíl'!$B$2:$C$252,2,FALSE))","v":"10:10:46"},{"$f":"IF(ISERROR(H239-G239),\"\",IF(H239=0,\"chybí čas\",H239-G239))","v":"00:05:46"},{"$f":"IF(D239=D238,J238+1,1)","v":2},{"$f":"VLOOKUP(C239,'Kategorie - UPRAV ROK!'!$A$18:$C$21,3,FALSE)","v":1}]
["Hájek Antonín",2020,"m",{"$f":"IF(B240=\"\",\"\",VLOOKUP('Kategorie - UPRAV ROK!'!$B$1-B240,'Kategorie - UPRAV ROK!'!$A$5:$G$13,OFFSET(B240,0,9)+3,TRUE))","v":"2 - PŘEDŽÁCI"},8,3,{"$f":"$N$14+F240/(60*24)","v":"10:03:00"},{"$f":"IF(ISERROR(VLOOKUP(E240,'Časy cíl'!$B$2:$C$252,2,FALSE)),\"\",VLOOKUP(E240,'Časy cíl'!$B$2:$C$252,2,FALSE))","v":"10:09:14"},{"$f":"IF(ISERROR(H240-G240),\"\",IF(H240=0,\"chybí čas\",H240-G240))","v":"00:06:14"},{"$f":"IF(D240=D239,J239+1,1)","v":3},{"$f":"VLOOKUP(C240,'Kategorie - UPRAV ROK!'!$A$18:$C$21,3,FALSE)","v":1}]
["Kopřivová Emily",2021,"z",{"$f":"IF(B241=\"\",\"\",VLOOKUP('Kategorie - UPRAV ROK!'!$B$1-B241,'Kategorie - UPRAV ROK!'!$A$5:$G$13,OFFSET(B241,0,9)+3,TRUE))","v":"2 - PŘEDŽÁCI"},12,4,{"$f":"$N$14+F241/(60*24)","v":"10:04:00"},{"$f":"IF(ISERROR(VLOOKUP(E241,'Časy cíl'!$B$2:$C$252,2,FALSE)),\"\",VLOOKUP(E241,'Časy cíl'!$B$2:$C$252,2,FALSE))","v":"10:10:22"},{"$f":"IF(ISERROR(H241-G241),\"\",IF(H241=0,\"chybí čas\",H241-G241))","v":"00:06:22"},{"$f":"IF(D241=D240,J240+1,1)","v":4},{"$f":"VLOOKUP(C241,'Kategorie - UPRAV ROK!'!$A$18:$C$21,3,FALSE)","v":2}]
["Hájková Hana",2020,"z",{"$f":"IF(B242=\"\",\"\",VLOOKUP('Kategorie - UPRAV ROK!'!$B$1-B242,'Kategorie - UPRAV ROK!'!$A$5:$G$13,OFFSET(B242,0,9)+3,TRUE))","v":"2 - PŘEDŽÁCI"},9,3,{"$f":"$N$14+F242/(60*24)","v":"10:03:00"},{"$f":"IF(ISERROR(VLOOKUP(E242,'Časy cíl'!$B$2:$C$252,2,FALSE)),\"\",VLOOKUP(E242,'Časy cíl'!$B$2:$C$252,2,FALSE))","v":"10:09:40"},{"$f":"IF(ISERROR(H242-G242),\"\",IF(H242=0,\"chybí čas\",H242-G242))","v":"00:06:40"},{"$f":"IF(D242=D241,J241+1,1)","v":5},{"$f":"VLOOKUP(C242,'Kategorie - UPRAV ROK!'!$A$18:$C$21,3,FALSE)","v":2}]
["Kolinský Kryštof",2021,"m",{"$f":"IF(B243=\"\",\"\",VLOOKUP('Kategorie - UPRAV ROK!'!$B$1-B243,'Kategorie - UPRAV ROK!'!$A$5:$G$13,OFFSET(B243,0,9)+3,TRUE))","v":"2 - PŘEDŽÁCI"},11,4,{"$f":"$N$14+F243/(60*24)","v":"10:04:00"},{"$f":"IF(ISERROR(VLOOKUP(E243,'Časy cíl'!$B$2:$C$252,2,FALSE)),\"\",VLOOKUP(E243,'Časy cíl'!$B$2:$C$252,2,FALSE))","v":"10:11:35"},{"$f":"IF(ISERROR(H243-G243),\"\",IF(H243=0,\"chybí čas\",H243-G243))","v":"00:07:35"},{"$f":"IF(D243=D242,J242+1,1)","v":6},{"$f":"VLOOKUP(C243,'Kategorie - UPRAV ROK!'!$A$18:$C$21,3,FALSE)","v":1}]
["Hrežíková Elena",2021,"hz",{"$f":"IF(B244=\"\",\"\",VLOOKUP('Kategorie - UPRAV ROK!'!$B$1-B244,'Kategorie - UPRAV ROK!'!$A$5:$G$13,OFFSET(B244,0,9)+3,TRUE))","v":"2 - PŘEDŽÁCI"},10,4,{"$f":"$N$14+F244/(60*24)","v":"10:04:00"},{"$f":"IF(ISERROR(VLOOKUP(E244,'Časy cíl'!$B$2:$C$252,2,FALSE)),\"\",VLOOKUP(E244,'Časy cíl'!$B$2:$C$252,2,FALSE))","v":"10:11:58"},{"$f":"IF(ISERROR(H244-G244),\"\",IF(H244=0,\"chybí čas\",H244-G244))","v":"00:07:58"},{"$f":"IF(D244=D243,J243+1,1)","v":7},{"$f":"VLOOKUP(C244,'Kategorie - UPRAV ROK!'!$A$18:$C$21,3,FALSE)","v":4}]
["Šváb Jan",2021,"m",{"$f":"IF(B245=\"\",\"\",VLOOKUP('Kategorie - UPRAV ROK!'!$B$1-B245,'Kategorie - UPRAV ROK!'!$A$5:$G$13,OFFSET(B245,0,9)+3,TRUE))","v":"2 - PŘEDŽÁCI"},13,5,{"$f":"$N$14+F245/(60*24)","v":"10:05:00"},{"$f":"IF(ISERROR(VLOOKUP(E245,'Časy cíl'!$B$2:$C$252,2,FALSE)),\"\",VLOOKUP(E245,'Časy cíl'!$B$2:$C$252,2,FALSE))","v":"10:13:13"},{"$f":"IF(ISERROR(H245-G245),\"\",IF(H245=0,\"chybí čas\",H245-G245))","v":"00:08:13"},{"$f":"IF(D245=D244,J244+1,1)","v":8},{"$f":"VLOOKUP(C245,'Kategorie - UPRAV ROK!'!$A$18:$C$21,3,FALSE)","v":1}]
["Čečelský Jonáš",2021,"m",{"$f":"IF(B246=\"\",\"\",VLOOKUP('Kategorie - UPRAV ROK!'!$B$1-B246,'Kategorie - UPRAV ROK!'!$A$5:$G$13,OFFSET(B246,0,9)+3,TRUE))","v":"2 - PŘEDŽÁCI"},null,null,{"$f":"$N$14+F246/(60*24)","v":"10:00:00"},{"$f":"IF(ISERROR(VLOOKUP(E246,'Časy cíl'!$B$2:$C$252,2,FALSE)),\"\",VLOOKUP(E246,'Časy cíl'!$B$2:$C$252,2,FALSE))","v":""},{"$f":"IF(ISERROR(H246-G246),\"\",IF(H246=0,\"chybí čas\",H246-G246))","v":""},{"$f":"IF(D246=D245,J245+1,1)","v":9},{"$f":"VLOOKUP(C246,'Kategorie - UPRAV ROK!'!$A$18:$C$21,3,FALSE)","v":1}]
["Ledvina Matěj",2021,"m",{"$f":"IF(B247=\"\",\"\",VLOOKUP('Kategorie - UPRAV ROK!'!$B$1-B247,'Kategorie - UPRAV ROK!'!$A$5:$G$13,OFFSET(B247,0,9)+3,TRUE))","v":"2 - PŘEDŽÁCI"},null,null,{"$f":"$N$14+F247/(60*24)","v":"10:00:00"},{"$f":"IF(ISERROR(VLOOKUP(E247,'Časy cíl'!$B$2:$C$252,2,FALSE)),\"\",VLOOKUP(E247,'Časy cíl'!$B$2:$C$252,2,FALSE))","v":""},{"$f":"IF(ISERROR(H247-G247),\"\",IF(H247=0,\"chybí čas\",H247-G247))","v":""},{"$f":"IF(D247=D246,J246+1,1)","v":10},{"$f":"VLOOKUP(C247,'Kategorie - UPRAV ROK!'!$A$18:$C$21,3,FALSE)","v":1}]
["Nováček Antonín",2020,"m",{"$f":"IF(B248=\"\",\"\",VLOOKUP('Kategorie - UPRAV ROK!'!$B$1-B248,'Kategorie - UPRAV ROK!'!$A$5:$G$13,OFFSET(B248,0,9)+3,TRUE))","v":"2 - PŘEDŽÁCI"},null,null,{"$f":"$N$14+F248/(60*24)","v":"10:00:00"},{"$f":"IF(ISERROR(VLOOKUP(E248,'Časy cíl'!$B$2:$C$252,2,FALSE)),\"\",VLOOKUP(E248,'Časy cíl'!$B$2:$C$252,2,FALSE))","v":""},{"$f":"IF(ISERROR(H248-G248),\"\",IF(H248=0,\"chybí čas\",H248-G248))","v":""},{"$f":"IF(D248=D247,J247+1,1)","v":11},{"$f":"VLOOKUP(C248,'Kategorie - UPRAV ROK!'!$A$18:$C$21,3,FALSE)","v":1}]
["Trávníček Patrik",2017,"m",{"$f":"IF(B249=\"\",\"\",VLOOKUP('[1]Kategorie - UPRAV ROK!'!$B$1-B249,'[1]Kategorie - UPRAV ROK!'!$A$5:$G$13,OFFSET(B249,0,9)+3,TRUE))","v":"3 - MLADŠÍ ŽÁCI"},19,8,{"$f":"$N$14+F249/(60*24)","v":"10:08:00"},{"$f":"IF(ISERROR(VLOOKUP(E249,'Časy cíl'!$B$2:$C$252,2,FALSE)),\"\",VLOOKUP(E249,'Časy cíl'!$B$2:$C$252,2,FALSE))","v":"10:12:21"},{"$f":"IF(ISERROR(H249-G249),\"\",IF(H249=0,\"chybí čas\",H249-G249))","v":"00:04:21"},{"$f":"IF(D249=D248,J248+1,1)","v":1},{"$f":"VLOOKUP(C249,'Kategorie - UPRAV ROK!'!$A$18:$C$21,3,FALSE)","v":1}]
["Havelka Šimon",2018,"hm",{"$f":"IF(B250=\"\",\"\",VLOOKUP('Kategorie - UPRAV ROK!'!$B$1-B250,'Kategorie - UPRAV ROK!'!$A$5:$G$13,OFFSET(B250,0,9)+3,TRUE))","v":"3 - MLADŠÍ ŽÁCI"},16,6,{"$f":"$N$14+F250/(60*24)","v":"10:06:00"},{"$f":"IF(ISERROR(VLOOKUP(E250,'Časy cíl'!$B$2:$C$252,2,FALSE)),\"\",VLOOKUP(E250,'Časy cíl'!$B$2:$C$252,2,FALSE))","v":"10:10:35"},{"$f":"IF(ISERROR(H250-G250),\"\",IF(H250=0,\"chybí čas\",H250-G250))","v":"00:04:35"},{"$f":"IF(D250=D249,J249+1,1)","v":2},{"$f":"VLOOKUP(C250,'Kategorie - UPRAV ROK!'!$A$18:$C$21,3,FALSE)","v":3}]
["Semenský Teodor",2019,"m",{"$f":"IF(B251=\"\",\"\",VLOOKUP('Kategorie - UPRAV ROK!'!$B$1-B251,'Kategorie - UPRAV ROK!'!$A$5:$G$13,OFFSET(B251,0,9)+3,TRUE))","v":"3 - MLADŠÍ ŽÁCI"},18,7,{"$f":"$N$14+F251/(60*24)","v":"10:07:00"},{"$f":"IF(ISERROR(VLOOKUP(E251,'Časy cíl'!$B$2:$C$252,2,FALSE)),\"\",VLOOKUP(E251,'Časy cíl'!$B$2:$C$252,2,FALSE))","v":"10:11:59"},{"$f":"IF(ISERROR(H251-G251),\"\",IF(H251=0,\"chybí čas\",H251-G251))","v":"00:04:59"},{"$f":"IF(D251=D250,J250+1,1)","v":3},{"$f":"VLOOKUP(C251,'Kategorie - UPRAV ROK!'!$A$18:$C$21,3,FALSE)","v":1}]
["Menzel Kryštof",2019,"m",{"$f":"IF(B252=\"\",\"\",VLOOKUP('Kategorie - UPRAV ROK!'!$B$1-B252,'Kategorie - UPRAV ROK!'!$A$5:$G$13,OFFSET(B252,0,9)+3,TRUE))","v":"3 - MLADŠÍ ŽÁCI"},17,7,{"$f":"$N$14+F252/(60*24)","v":"10:07:00"},{"$f":"IF(ISERROR(VLOOKUP(E252,'Časy cíl'!$B$2:$C$252,2,FALSE)),\"\",VLOOKUP(E252,'Časy cíl'!$B$2:$C$252,2,FALSE))","v":"10:12:08"},{"$f":"IF(ISERROR(H252-G252),\"\",IF(H252=0,\"chybí čas\",H252-G252))","v":"00:05:08"},{"$f":"IF(D252=D251,J251+1,1)","v":4},{"$f":"VLOOKUP(C252,'Kategorie - UPRAV ROK!'!$A$18:$C$21,3,FALSE)","v":1}]
["Beránek Radek",2018,"m",{"$f":"IF(B253=\"\",\"\",VLOOKUP('Kategorie - UPRAV ROK!'!$B$1-B253,'Kategorie - UPRAV ROK!'!$A$5:$G$13,OFFSET(B253,0,9)+3,TRUE))","v":"3 - MLADŠÍ ŽÁCI"},20,8,{"$f":"$N$14+F253/(60*24)","v":"10:08:00"},{"$f":"IF(ISERROR(VLOOKUP(E253,'Časy cíl'!$B$2:$C$252,2,FALSE)),\"\",VLOOKUP(E253,'Časy cíl'!$B$2:$C$252,2,FALSE))","v":"10:13:23"},{"$f":"IF(ISERROR(H253-G253),\"\",IF(H253=0,\"chybí čas\",H253-G253))","v":"00:05:23"},{"$f":"IF(D253=D252,J252+1,1)","v":5},{"$f":"VLOOKUP(C253,'Kategorie - UPRAV ROK!'!$A$18:$C$21,3,FALSE)","v":1}]
["Gável Luboš",2019,"hm",{"$f":"IF(B254=\"\",\"\",VLOOKUP('Kategorie - UPRAV ROK!'!$B$1-B254,'Kategorie - UPRAV ROK!'!$A$5:$G$13,OFFSET(B254,0,9)+3,TRUE))","v":"3 - MLADŠÍ ŽÁCI"},15,6,{"$f":"$N$14+F254/(60*24)","v":"10:06:00"},{"$f":"IF(ISERROR(VLOOKUP(E254,'Časy cíl'!$B$2:$C$252,2,FALSE)),\"\",VLOOKUP(E254,'Časy cíl'!$B$2:$C$252,2,FALSE))","v":"10:11:44"},{"$f":"IF(ISERROR(H254-G254),\"\",IF(H254=0,\"chybí čas\",H254-G254))","v":"00:05:44"},{"$f":"IF(D254=D253,J253+1,1)","v":6},{"$f":"VLOOKUP(C254,'Kategorie - UPRAV ROK!'!$A$18:$C$21,3,FALSE)","v":3}]
["Müllerová Jožík",2019,"hz",{"$f":"IF(B255=\"\",\"\",VLOOKUP('Kategorie - UPRAV ROK!'!$B$1-B255,'Kategorie - UPRAV ROK!'!$A$5:$G$13,OFFSET(B255,0,9)+3,TRUE))","v":"3 - MLADŠÍ ŽÁCI - DÍVKY"},22,9,{"$f":"$N$14+F255/(60*24)","v":"10:09:00"},{"$f":"IF(ISERROR(VLOOKUP(E255,'Časy cíl'!$B$2:$C$252,2,FALSE)),\"\",VLOOKUP(E255,'Časy cíl'!$B$2:$C$252,2,FALSE))","v":"10:13:28"},{"$f":"IF(ISERROR(H255-G255),\"\",IF(H255=0,\"chybí čas\",H255-G255))","v":"00:04:28"},{"$f":"IF(D255=D254,J254+1,1)","v":1},{"$f":"VLOOKUP(C255,'Kategorie - UPRAV ROK!'!$A$18:$C$21,3,FALSE)","v":4}]
["Tvarohová Klára",2018,"z",{"$f":"IF(B256=\"\",\"\",VLOOKUP('Kategorie - UPRAV ROK!'!$B$1-B256,'Kategorie - UPRAV ROK!'!$A$5:$G$13,OFFSET(B256,0,9)+3,TRUE))","v":"3 - MLADŠÍ ŽÁCI - DÍVKY"},24,10,{"$f":"$N$14+F256/(60*24)","v":"10:10:00"},{"$f":"IF(ISERROR(VLOOKUP(E256,'Časy cíl'!$B$2:$C$252,2,FALSE)),\"\",VLOOKUP(E256,'Časy cíl'!$B$2:$C$252,2,FALSE))","v":"10:15:18"},{"$f":"IF(ISERROR(H256-G256),\"\",IF(H256=0,\"chybí čas\",H256-G256))","v":"00:05:18"},{"$f":"IF(D256=D255,J255+1,1)","v":2},{"$f":"VLOOKUP(C256,'Kategorie - UPRAV ROK!'!$A$18:$C$21,3,FALSE)","v":2}]
["Tesařová Romana",2018,"z",{"$f":"IF(B257=\"\",\"\",VLOOKUP('Kategorie - UPRAV ROK!'!$B$1-B257,'Kategorie - UPRAV ROK!'!$A$5:$G$13,OFFSET(B257,0,9)+3,TRUE))","v":"3 - MLADŠÍ ŽÁCI - DÍVKY"},23,10,{"$f":"$N$14+F257/(60*24)","v":"10:10:00"},{"$f":"IF(ISERROR(VLOOKUP(E257,'Časy cíl'!$B$2:$C$252,2,FALSE)),\"\",VLOOKUP(E257,'Časy cíl'!$B$2:$C$252,2,FALSE))","v":"10:15:41"},{"$f":"IF(ISERROR(H257-G257),\"\",IF(H257=0,\"chybí čas\",H257-G257))","v":"00:05:41"},{"$f":"IF(D257=D256,J256+1,1)","v":3},{"$f":"VLOOKUP(C257,'Kategorie - UPRAV ROK!'!$A$18:$C$21,3,FALSE)","v":2}]
["Jílková Helena",2019,"hz",{"$f":"IF(B258=\"\",\"\",VLOOKUP('Kategorie - UPRAV ROK!'!$B$1-B258,'Kategorie - UPRAV ROK!'!$A$5:$G$13,OFFSET(B258,0,9)+3,TRUE))","v":"3 - MLADŠÍ ŽÁCI - DÍVKY"},21,9,{"$f":"$N$14+F258/(60*24)","v":"10:09:00"},{"$f":"IF(ISERROR(VLOOKUP(E258,'Časy cíl'!$B$2:$C$252,2,FALSE)),\"\",VLOOKUP(E258,'Časy cíl'!$B$2:$C$252,2,FALSE))","v":"10:15:01"},{"$f":"IF(ISERROR(H258-G258),\"\",IF(H258=0,\"chybí čas\",H258-G258))","v":"00:06:01"},{"$f":"IF(D258=D257,J257+1,1)","v":4},{"$f":"VLOOKUP(C258,'Kategorie - UPRAV ROK!'!$A$18:$C$21,3,FALSE)","v":4}]
["Paldusová Lilien",2019,"z",{"$f":"IF(B259=\"\",\"\",VLOOKUP('Kategorie - UPRAV ROK!'!$B$1-B259,'Kategorie - UPRAV ROK!'!$A$5:$G$13,OFFSET(B259,0,9)+3,TRUE))","v":"3 - MLADŠÍ ŽÁCI - DÍVKY"},25,10,{"$f":"$N$14+F259/(60*24)","v":"10:10:00"},{"$f":"IF(ISERROR(VLOOKUP(E259,'Časy cíl'!$B$2:$C$252,2,FALSE)),\"\",VLOOKUP(E259,'Časy cíl'!$B$2:$C$252,2,FALSE))","v":"10:16:55"},{"$f":"IF(ISERROR(H259-G259),\"\",IF(H259=0,\"chybí čas\",H259-G259))","v":"00:06:55"},{"$f":"IF(D259=D258,J258+1,1)","v":5},{"$f":"VLOOKUP(C259,'Kategorie - UPRAV ROK!'!$A$18:$C$21,3,FALSE)","v":2}]
["Ledvinová Marie",2018,"z",{"$f":"IF(B260=\"\",\"\",VLOOKUP('Kategorie - UPRAV ROK!'!$B$1-B260,'Kategorie - UPRAV ROK!'!$A$5:$G$13,OFFSET(B260,0,9)+3,TRUE))","v":"3 - MLADŠÍ ŽÁCI - DÍVKY"},null,null,{"$f":"$N$14+F260/(60*24)","v":"10:00:00"},{"$f":"IF(ISERROR(VLOOKUP(E260,'Časy cíl'!$B$2:$C$252,2,FALSE)),\"\",VLOOKUP(E260,'Časy cíl'!$B$2:$C$252,2,FALSE))","v":""},{"$f":"IF(ISERROR(H260-G260),\"\",IF(H260=0,\"chybí čas\",H260-G260))","v":""},{"$f":"IF(D260=D259,J259+1,1)","v":6},{"$f":"VLOOKUP(C260,'Kategorie - UPRAV ROK!'!$A$18:$C$21,3,FALSE)","v":2}]
["Tvaroh Ondřej",2016,"m",{"$f":"IF(B261=\"\",\"\",VLOOKUP('Kategorie - UPRAV ROK!'!$B$1-B261,'Kategorie - UPRAV ROK!'!$A$5:$G$13,OFFSET(B261,0,9)+3,TRUE))","v":"4 - ŽÁCI"},29,12,{"$f":"$N$14+F261/(60*24)","v":"10:12:00"},{"$f":"IF(ISERROR(VLOOKUP(E261,'Časy cíl'!$B$2:$C$252,2,FALSE)),\"\",VLOOKUP(E261,'Časy cíl'!$B$2:$C$252,2,FALSE))","v":"10:15:49"},{"$f":"IF(ISERROR(H261-G261),\"\",IF(H261=0,\"chybí čas\",H261-G261))","v":"00:03:49"},{"$f":"IF(D261=D260,J260+1,1)","v":1},{"$f":"VLOOKUP(C261,'Kategorie - UPRAV ROK!'!$A$18:$C$21,3,FALSE)","v":1}]
["Havelka Martin",2016,"hm",{"$f":"IF(B262=\"\",\"\",VLOOKUP('Kategorie - UPRAV ROK!'!$B$1-B262,'Kategorie - UPRAV ROK!'!$A$5:$G$13,OFFSET(B262,0,9)+3,TRUE))","v":"4 - ŽÁCI"},28,12,{"$f":"$N$14+F262/(60*24)","v":"10:12:00"},{"$f":"IF(ISERROR(VLOOKUP(E262,'Časy cíl'!$B$2:$C$252,2,FALSE)),\"\",VLOOKUP(E262,'Časy cíl'!$B$2:$C$252,2,FALSE))","v":"10:16:40"},{"$f":"IF(ISERROR(H262-G262),\"\",IF(H262=0,\"chybí čas\",H262-G262))","v":"00:04:40"},{"$f":"IF(D262=D261,J261+1,1)","v":2},{"$f":"VLOOKUP(C262,'Kategorie - UPRAV ROK!'!$A$18:$C$21,3,FALSE)","v":3}]
["Dvořák Jonáš",2017,"m",{"$f":"IF(B263=\"\",\"\",VLOOKUP('Kategorie - UPRAV ROK!'!$B$1-B263,'Kategorie - UPRAV ROK!'!$A$5:$G$13,OFFSET(B263,0,9)+3,TRUE))","v":"4 - ŽÁCI"},26,11,{"$f":"$N$14+F263/(60*24)","v":"10:11:00"},{"$f":"IF(ISERROR(VLOOKUP(E263,'Časy cíl'!$B$2:$C$252,2,FALSE)),\"\",VLOOKUP(E263,'Časy cíl'!$B$2:$C$252,2,FALSE))","v":"10:15:46"},{"$f":"IF(ISERROR(H263-G263),\"\",IF(H263=0,\"chybí čas\",H263-G263))","v":"00:04:46"},{"$f":"IF(D263=D262,J262+1,1)","v":3},{"$f":"VLOOKUP(C263,'Kategorie - UPRAV ROK!'!$A$18:$C$21,3,FALSE)","v":1}]
["Hájek Adam",2017,"m",{"$f":"IF(B264=\"\",\"\",VLOOKUP('Kategorie - UPRAV ROK!'!$B$1-B264,'Kategorie - UPRAV ROK!'!$A$5:$G$13,OFFSET(B264,0,9)+3,TRUE))","v":"4 - ŽÁCI"},27,11,{"$f":"$N$14+F264/(60*24)","v":"10:11:00"},{"$f":"IF(ISERROR(VLOOKUP(E264,'Časy cíl'!$B$2:$C$252,2,FALSE)),\"\",VLOOKUP(E264,'Časy cíl'!$B$2:$C$252,2,FALSE))","v":"10:15:57"},{"$f":"IF(ISERROR(H264-G264),\"\",IF(H264=0,\"chybí čas\",H264-G264))","v":"00:04:57"},{"$f":"IF(D264=D263,J263+1,1)","v":4},{"$f":"VLOOKUP(C264,'Kategorie - UPRAV ROK!'!$A$18:$C$21,3,FALSE)","v":1}]
["Nováček Jan",2016,"m",{"$f":"IF(B265=\"\",\"\",VLOOKUP('Kategorie - UPRAV ROK!'!$B$1-B265,'Kategorie - UPRAV ROK!'!$A$5:$G$13,OFFSET(B265,0,9)+3,TRUE))","v":"4 - ŽÁCI"},null,null,{"$f":"$N$14+F265/(60*24)","v":"10:00:00"},{"$f":"IF(ISERROR(VLOOKUP(E265,'Časy cíl'!$B$2:$C$252,2,FALSE)),\"\",VLOOKUP(E265,'Časy cíl'!$B$2:$C$252,2,FALSE))","v":""},{"$f":"IF(ISERROR(H265-G265),\"\",IF(H265=0,\"chybí čas\",H265-G265))","v":""},{"$f":"IF(D265=D264,J264+1,1)","v":5},{"$f":"VLOOKUP(C265,'Kategorie - UPRAV ROK!'!$A$18:$C$21,3,FALSE)","v":1}]
["Schnabl Prokop",2016,"m",{"$f":"IF(B266=\"\",\"\",VLOOKUP('Kategorie - UPRAV ROK!'!$B$1-B266,'Kategorie - UPRAV ROK!'!$A$5:$G$13,OFFSET(B266,0,9)+3,TRUE))","v":"4 - ŽÁCI"},null,null,{"$f":"$N$14+F266/(60*24)","v":"10:00:00"},{"$f":"IF(ISERROR(VLOOKUP(E266,'Časy cíl'!$B$2:$C$252,2,FALSE)),\"\",VLOOKUP(E266,'Časy cíl'!$B$2:$C$252,2,FALSE))","v":""},{"$f":"IF(ISERROR(H266-G266),\"\",IF(H266=0,\"chybí čas\",H266-G266))","v":""},{"$f":"IF(D266=D265,J265+1,1)","v":6},{"$f":"VLOOKUP(C266,'Kategorie - UPRAV ROK!'!$A$18:$C$21,3,FALSE)","v":1}]
["Jonášová Anna",2016,"z",{"$f":"IF(B267=\"\",\"\",VLOOKUP('Kategorie - UPRAV ROK!'!$B$1-B267,'Kategorie - UPRAV ROK!'!$A$5:$G$13,OFFSET(B267,0,9)+3,TRUE))","v":"4 - ŽÁCI - DÍVKY"},31,13,{"$f":"$N$14+F267/(60*24)","v":"10:13:00"},{"$f":"IF(ISERROR(VLOOKUP(E267,'Časy cíl'!$B$2:$C$252,2,FALSE)),\"\",VLOOKUP(E267,'Časy cíl'!$B$2:$C$252,2,FALSE))","v":"10:17:48"},{"$f":"IF(ISERROR(H267-G267),\"\",IF(H267=0,\"chybí čas\",H267-G267))","v":"00:04:48"},{"$f":"IF(D267=D266,J266+1,1)","v":1},{"$f":"VLOOKUP(C267,'Kategorie - UPRAV ROK!'!$A$18:$C$21,3,FALSE)","v":2}]
["Filipová Adriana",2017,"z",{"$f":"IF(B268=\"\",\"\",VLOOKUP('Kategorie - UPRAV ROK!'!$B$1-B268,'Kategorie - UPRAV ROK!'!$A$5:$G$13,OFFSET(B268,0,9)+3,TRUE))","v":"4 - ŽÁCI - DÍVKY"},30,13,{"$f":"$N$14+F268/(60*24)","v":"10:13:00"},{"$f":"IF(ISERROR(VLOOKUP(E268,'Časy cíl'!$B$2:$C$252,2,FALSE)),\"\",VLOOKUP(E268,'Časy cíl'!$B$2:$C$252,2,FALSE))","v":"10:17:52"},{"$f":"IF(ISERROR(H268-G268),\"\",IF(H268=0,\"chybí čas\",H268-G268))","v":"00:04:52"},{"$f":"IF(D268=D267,J267+1,1)","v":2},{"$f":"VLOOKUP(C268,'Kategorie - UPRAV ROK!'!$A$18:$C$21,3,FALSE)","v":2}]
["Pecháčková Ema",2016,"z",{"$f":"IF(B269=\"\",\"\",VLOOKUP('Kategorie - UPRAV ROK!'!$B$1-B269,'Kategorie - UPRAV ROK!'!$A$5:$G$13,OFFSET(B269,0,9)+3,TRUE))","v":"4 - ŽÁCI - DÍVKY"},35,15,{"$f":"$N$14+F269/(60*24)","v":"10:15:00"},{"$f":"IF(ISERROR(VLOOKUP(E269,'Časy cíl'!$B$2:$C$252,2,FALSE)),\"\",VLOOKUP(E269,'Časy cíl'!$B$2:$C$252,2,FALSE))","v":"10:19:52"},{"$f":"IF(ISERROR(H269-G269),\"\",IF(H269=0,\"chybí čas\",H269-G269))","v":"00:04:52"},{"$f":"IF(D269=D268,J268+1,1)","v":3},{"$f":"VLOOKUP(C269,'Kategorie - UPRAV ROK!'!$A$18:$C$21,3,FALSE)","v":2}]
["Štaflová Veronika",2017,"z",{"$f":"IF(B270=\"\",\"\",VLOOKUP('Kategorie - UPRAV ROK!'!$B$1-B270,'Kategorie - UPRAV ROK!'!$A$5:$G$13,OFFSET(B270,0,9)+3,TRUE))","v":"4 - ŽÁCI - DÍVKY"},36,16,{"$f":"$N$14+F270/(60*24)","v":"10:16:00"},{"$f":"IF(ISERROR(VLOOKUP(E270,'Časy cíl'!$B$2:$C$252,2,FALSE)),\"\",VLOOKUP(E270,'Časy cíl'!$B$2:$C$252,2,FALSE))","v":"10:21:00"},{"$f":"IF(ISERROR(H270-G270),\"\",IF(H270=0,\"chybí čas\",H270-G270))","v":"00:05:00"},{"$f":"IF(D270=D269,J269+1,1)","v":4},{"$f":"VLOOKUP(C270,'Kategorie - UPRAV ROK!'!$A$18:$C$21,3,FALSE)","v":2}]
["Marková Majda",2016,"hz",{"$f":"IF(B271=\"\",\"\",VLOOKUP('Kategorie - UPRAV ROK!'!$B$1-B271,'Kategorie - UPRAV ROK!'!$A$5:$G$13,OFFSET(B271,0,9)+3,TRUE))","v":"4 - ŽÁCI - DÍVKY"},34,15,{"$f":"$N$14+F271/(60*24)","v":"10:15:00"},{"$f":"IF(ISERROR(VLOOKUP(E271,'Časy cíl'!$B$2:$C$252,2,FALSE)),\"\",VLOOKUP(E271,'Časy cíl'!$B$2:$C$252,2,FALSE))","v":"10:20:01"},{"$f":"IF(ISERROR(H271-G271),\"\",IF(H271=0,\"chybí čas\",H271-G271))","v":"00:05:01"},{"$f":"IF(D271=D270,J270+1,1)","v":5},{"$f":"VLOOKUP(C271,'Kategorie - UPRAV ROK!'!$A$18:$C$21,3,FALSE)","v":4}]
["Tesařová Eliška",2016,"z",{"$f":"IF(B272=\"\",\"\",VLOOKUP('Kategorie - UPRAV ROK!'!$B$1-B272,'Kategorie - UPRAV ROK!'!$A$5:$G$13,OFFSET(B272,0,9)+3,TRUE))","v":"4 - ŽÁCI - DÍVKY"},37,16,{"$f":"$N$14+F272/(60*24)","v":"10:16:00"},{"$f":"IF(ISERROR(VLOOKUP(E272,'Časy cíl'!$B$2:$C$252,2,FALSE)),\"\",VLOOKUP(E272,'Časy cíl'!$B$2:$C$252,2,FALSE))","v":"10:21:02"},{"$f":"IF(ISERROR(H272-G272),\"\",IF(H272=0,\"chybí čas\",H272-G272))","v":"00:05:02"},{"$f":"IF(D272=D271,J271+1,1)","v":6},{"$f":"VLOOKUP(C272,'Kategorie - UPRAV ROK!'!$A$18:$C$21,3,FALSE)","v":2}]
["Kobková Karina",2017,"z",{"$f":"IF(B273=\"\",\"\",VLOOKUP('Kategorie - UPRAV ROK!'!$B$1-B273,'Kategorie - UPRAV ROK!'!$A$5:$G$13,OFFSET(B273,0,9)+3,TRUE))","v":"4 - ŽÁCI - DÍVKY"},32,14,{"$f":"$N$14+F273/(60*24)","v":"10:14:00"},{"$f":"IF(ISERROR(VLOOKUP(E273,'Časy cíl'!$B$2:$C$252,2,FALSE)),\"\",VLOOKUP(E273,'Časy cíl'!$B$2:$C$252,2,FALSE))","v":"10:19:07"},{"$f":"IF(ISERROR(H273-G273),\"\",IF(H273=0,\"chybí čas\",H273-G273))","v":"00:05:07"},{"$f":"IF(D273=D272,J272+1,1)","v":7},{"$f":"VLOOKUP(C273,'Kategorie - UPRAV ROK!'!$A$18:$C$21,3,FALSE)","v":2}]
["Majdlochova Apolena",2017,"z",{"$f":"IF(B274=\"\",\"\",VLOOKUP('Kategorie - UPRAV ROK!'!$B$1-B274,'Kategorie - UPRAV ROK!'!$A$5:$G$13,OFFSET(B274,0,9)+3,TRUE))","v":"4 - ŽÁCI - DÍVKY"},33,14,{"$f":"$N$14+F274/(60*24)","v":"10:14:00"},{"$f":"IF(ISERROR(VLOOKUP(E274,'Časy cíl'!$B$2:$C$252,2,FALSE)),\"\",VLOOKUP(E274,'Časy cíl'!$B$2:$C$252,2,FALSE))","v":"10:19:36"},{"$f":"IF(ISERROR(H274-G274),\"\",IF(H274=0,\"chybí čas\",H274-G274))","v":"00:05:36"},{"$f":"IF(D274=D273,J273+1,1)","v":8},{"$f":"VLOOKUP(C274,'Kategorie - UPRAV ROK!'!$A$18:$C$21,3,FALSE)","v":2}]
["Müller Štěpán",2015,"hm",{"$f":"IF(B275=\"\",\"\",VLOOKUP('Kategorie - UPRAV ROK!'!$B$1-B275,'Kategorie - UPRAV ROK!'!$A$5:$G$13,OFFSET(B275,0,9)+3,TRUE))","v":"5 - STARŠÍ ŽÁCI"},39,17,{"$f":"$N$14+F275/(60*24)","v":"10:17:00"},{"$f":"IF(ISERROR(VLOOKUP(E275,'Časy cíl'!$B$2:$C$252,2,FALSE)),\"\",VLOOKUP(E275,'Časy cíl'!$B$2:$C$252,2,FALSE))","v":"10:20:28"},{"$f":"IF(ISERROR(H275-G275),\"\",IF(H275=0,\"chybí čas\",H275-G275))","v":"00:03:28"},{"$f":"IF(D275=D274,J274+1,1)","v":1},{"$f":"VLOOKUP(C275,'Kategorie - UPRAV ROK!'!$A$18:$C$21,3,FALSE)","v":3}]
["Štafl František",2015,"m",{"$f":"IF(B276=\"\",\"\",VLOOKUP('Kategorie - UPRAV ROK!'!$B$1-B276,'Kategorie - UPRAV ROK!'!$A$5:$G$13,OFFSET(B276,0,9)+3,TRUE))","v":"5 - STARŠÍ ŽÁCI"},41,18,{"$f":"$N$14+F276/(60*24)","v":"10:18:00"},{"$f":"IF(ISERROR(VLOOKUP(E276,'Časy cíl'!$B$2:$C$252,2,FALSE)),\"\",VLOOKUP(E276,'Časy cíl'!$B$2:$C$252,2,FALSE))","v":"10:21:41"},{"$f":"IF(ISERROR(H276-G276),\"\",IF(H276=0,\"chybí čas\",H276-G276))","v":"00:03:41"},{"$f":"IF(D276=D275,J275+1,1)","v":2},{"$f":"VLOOKUP(C276,'Kategorie - UPRAV ROK!'!$A$18:$C$21,3,FALSE)","v":1}]
["Štafl Matěj",2014,"m",{"$f":"IF(B277=\"\",\"\",VLOOKUP('Kategorie - UPRAV ROK!'!$B$1-B277,'Kategorie - UPRAV ROK!'!$A$5:$G$13,OFFSET(B277,0,9)+3,TRUE))","v":"5 - STARŠÍ ŽÁCI"},42,18,{"$f":"$N$14+F277/(60*24)","v":"10:18:00"},{"$f":"IF(ISERROR(VLOOKUP(E277,'Časy cíl'!$B$2:$C$252,2,FALSE)),\"\",VLOOKUP(E277,'Časy cíl'!$B$2:$C$252,2,FALSE))","v":"10:21:47"},{"$f":"IF(ISERROR(H277-G277),\"\",IF(H277=0,\"chybí čas\",H277-G277))","v":"00:03:47"},{"$f":"IF(D277=D276,J276+1,1)","v":3},{"$f":"VLOOKUP(C277,'Kategorie - UPRAV ROK!'!$A$18:$C$21,3,FALSE)","v":1}]
["Pecháček Matěj",2014,"m",{"$f":"IF(B278=\"\",\"\",VLOOKUP('Kategorie - UPRAV ROK!'!$B$1-B278,'Kategorie - UPRAV ROK!'!$A$5:$G$13,OFFSET(B278,0,9)+3,TRUE))","v":"5 - STARŠÍ ŽÁCI"},40,18,{"$f":"$N$14+F278/(60*24)","v":"10:18:00"},{"$f":"IF(ISERROR(VLOOKUP(E278,'Časy cíl'!$B$2:$C$252,2,FALSE)),\"\",VLOOKUP(E278,'Časy cíl'!$B$2:$C$252,2,FALSE))","v":"10:21:52"},{"$f":"IF(ISERROR(H278-G278),\"\",IF(H278=0,\"chybí čas\",H278-G278))","v":"00:03:52"},{"$f":"IF(D278=D277,J277+1,1)","v":4},{"$f":"VLOOKUP(C278,'Kategorie - UPRAV ROK!'!$A$18:$C$21,3,FALSE)","v":1}]
["Marek Lukáš",2014,"m",{"$f":"IF(B279=\"\",\"\",VLOOKUP('Kategorie - UPRAV ROK!'!$B$1-B279,'Kategorie - UPRAV ROK!'!$A$5:$G$13,OFFSET(B279,0,9)+3,TRUE))","v":"5 - STARŠÍ ŽÁCI"},38,17,{"$f":"$N$14+F279/(60*24)","v":"10:17:00"},{"$f":"IF(ISERROR(VLOOKUP(E279,'Časy cíl'!$B$2:$C$252,2,FALSE)),\"\",VLOOKUP(E279,'Časy cíl'!$B$2:$C$252,2,FALSE))","v":"10:21:59"},{"$f":"IF(ISERROR(H279-G279),\"\",IF(H279=0,\"chybí čas\",H279-G279))","v":"00:04:59"},{"$f":"IF(D279=D278,J278+1,1)","v":5},{"$f":"VLOOKUP(C279,'Kategorie - UPRAV ROK!'!$A$18:$C$21,3,FALSE)","v":1}]
["Klonfarová Dita",2015,"hz",{"$f":"IF(B280=\"\",\"\",VLOOKUP('Kategorie - UPRAV ROK!'!$B$1-B280,'Kategorie - UPRAV ROK!'!$A$5:$G$13,OFFSET(B280,0,9)+3,TRUE))","v":"5 - STARŠÍ ŽÁCI - DÍVKY"},44,19,{"$f":"$N$14+F280/(60*24)","v":"10:19:00"},{"$f":"IF(ISERROR(VLOOKUP(E280,'Časy cíl'!$B$2:$C$252,2,FALSE)),\"\",VLOOKUP(E280,'Časy cíl'!$B$2:$C$252,2,FALSE))","v":"10:23:22"},{"$f":"IF(ISERROR(H280-G280),\"\",IF(H280=0,\"chybí čas\",H280-G280))","v":"00:04:22"},{"$f":"IF(D280=D279,J279+1,1)","v":1},{"$f":"VLOOKUP(C280,'Kategorie - UPRAV ROK!'!$A$18:$C$21,3,FALSE)","v":4}]
["Trávníčková Tereza",2015,"z",{"$f":"IF(B281=\"\",\"\",VLOOKUP('Kategorie - UPRAV ROK!'!$B$1-B281,'Kategorie - UPRAV ROK!'!$A$5:$G$13,OFFSET(B281,0,9)+3,TRUE))","v":"5 - STARŠÍ ŽÁCI - DÍVKY"},45,19,{"$f":"$N$14+F281/(60*24)","v":"10:19:00"},{"$f":"IF(ISERROR(VLOOKUP(E281,'Časy cíl'!$B$2:$C$252,2,FALSE)),\"\",VLOOKUP(E281,'Časy cíl'!$B$2:$C$252,2,FALSE))","v":"10:23:26"},{"$f":"IF(ISERROR(H281-G281),\"\",IF(H281=0,\"chybí čas\",H281-G281))","v":"00:04:26"},{"$f":"IF(D281=D280,J280+1,1)","v":2},{"$f":"VLOOKUP(C281,'Kategorie - UPRAV ROK!'!$A$18:$C$21,3,FALSE)","v":2}]
["Dvořáková Nicol",2015,"z",{"$f":"IF(B282=\"\",\"\",VLOOKUP('Kategorie - UPRAV ROK!'!$B$1-B282,'Kategorie - UPRAV ROK!'!$A$5:$G$13,OFFSET(B282,0,9)+3,TRUE))","v":"5 - STARŠÍ ŽÁCI - DÍVKY"},43,19,{"$f":"$N$14+F282/(60*24)","v":"10:19:00"},{"$f":"IF(ISERROR(VLOOKUP(E282,'Časy cíl'!$B$2:$C$252,2,FALSE)),\"\",VLOOKUP(E282,'Časy cíl'!$B$2:$C$252,2,FALSE))","v":"10:25:00"},{"$f":"IF(ISERROR(H282-G282),\"\",IF(H282=0,\"chybí čas\",H282-G282))","v":"00:06:00"},{"$f":"IF(D282=D281,J281+1,1)","v":3},{"$f":"VLOOKUP(C282,'Kategorie - UPRAV ROK!'!$A$18:$C$21,3,FALSE)","v":2}]
["Štafl Štěpán",2012,"m",{"$f":"IF(B283=\"\",\"\",VLOOKUP('Kategorie - UPRAV ROK!'!$B$1-B283,'Kategorie - UPRAV ROK!'!$A$5:$G$13,OFFSET(B283,0,9)+3,TRUE))","v":"6 - MLADŠÍ DOROST"},49,21,{"$f":"$N$14+F283/(60*24)","v":"10:21:00"},{"$f":"IF(ISERROR(VLOOKUP(E283,'Časy cíl'!$B$2:$C$252,2,FALSE)),\"\",VLOOKUP(E283,'Časy cíl'!$B$2:$C$252,2,FALSE))","v":"10:24:19"},{"$f":"IF(ISERROR(H283-G283),\"\",IF(H283=0,\"chybí čas\",H283-G283))","v":"00:03:19"},{"$f":"IF(D283=D282,J282+1,1)","v":1},{"$f":"VLOOKUP(C283,'Kategorie - UPRAV ROK!'!$A$18:$C$21,3,FALSE)","v":1}]
["Muchka Josef",2013,"m",{"$f":"IF(B284=\"\",\"\",VLOOKUP('Kategorie - UPRAV ROK!'!$B$1-B284,'Kategorie - UPRAV ROK!'!$A$5:$G$13,OFFSET(B284,0,9)+3,TRUE))","v":"6 - MLADŠÍ DOROST"},47,20,{"$f":"$N$14+F284/(60*24)","v":"10:20:00"},{"$f":"IF(ISERROR(VLOOKUP(E284,'Časy cíl'!$B$2:$C$252,2,FALSE)),\"\",VLOOKUP(E284,'Časy cíl'!$B$2:$C$252,2,FALSE))","v":"10:23:34"},{"$f":"IF(ISERROR(H284-G284),\"\",IF(H284=0,\"chybí čas\",H284-G284))","v":"00:03:34"},{"$f":"IF(D284=D283,J283+1,1)","v":2},{"$f":"VLOOKUP(C284,'Kategorie - UPRAV ROK!'!$A$18:$C$21,3,FALSE)","v":1}]
["Štafl Antonín",2013,"m",{"$f":"IF(B285=\"\",\"\",VLOOKUP('Kategorie - UPRAV ROK!'!$B$1-B285,'Kategorie - UPRAV ROK!'!$A$5:$G$13,OFFSET(B285,0,9)+3,TRUE))","v":"6 - MLADŠÍ DOROST"},48,21,{"$f":"$N$14+F285/(60*24)","v":"10:21:00"},{"$f":"IF(ISERROR(VLOOKUP(E285,'Časy cíl'!$B$2:$C$252,2,FALSE)),\"\",VLOOKUP(E285,'Časy cíl'!$B$2:$C$252,2,FALSE))","v":"10:24:37"},{"$f":"IF(ISERROR(H285-G285),\"\",IF(H285=0,\"chybí čas\",H285-G285))","v":"00:03:37"},{"$f":"IF(D285=D284,J284+1,1)","v":3},{"$f":"VLOOKUP(C285,'Kategorie - UPRAV ROK!'!$A$18:$C$21,3,FALSE)","v":1}]
["Majdloch Albert",2013,"m",{"$f":"IF(B286=\"\",\"\",VLOOKUP('Kategorie - UPRAV ROK!'!$B$1-B286,'Kategorie - UPRAV ROK!'!$A$5:$G$13,OFFSET(B286,0,9)+3,TRUE))","v":"6 - MLADŠÍ DOROST"},46,20,{"$f":"$N$14+F286/(60*24)","v":"10:20:00"},{"$f":"IF(ISERROR(VLOOKUP(E286,'Časy cíl'!$B$2:$C$252,2,FALSE)),\"\",VLOOKUP(E286,'Časy cíl'!$B$2:$C$252,2,FALSE))","v":"10:24:10"},{"$f":"IF(ISERROR(H286-G286),\"\",IF(H286=0,\"chybí čas\",H286-G286))","v":"00:04:10"},{"$f":"IF(D286=D285,J285+1,1)","v":4},{"$f":"VLOOKUP(C286,'Kategorie - UPRAV ROK!'!$A$18:$C$21,3,FALSE)","v":1}]
["Nováčková Anežka",2012,"z",{"$f":"IF(B287=\"\",\"\",VLOOKUP('Kategorie - UPRAV ROK!'!$B$1-B287,'Kategorie - UPRAV ROK!'!$A$5:$G$13,OFFSET(B287,0,9)+3,TRUE))","v":"6 - MLADŠÍ DOROST - DÍVKY"},null,null,{"$f":"$N$14+F287/(60*24)","v":"10:00:00"},{"$f":"IF(ISERROR(VLOOKUP(E287,'Časy cíl'!$B$2:$C$252,2,FALSE)),\"\",VLOOKUP(E287,'Časy cíl'!$B$2:$C$252,2,FALSE))","v":""},{"$f":"IF(ISERROR(H287-G287),\"\",IF(H287=0,\"chybí čas\",H287-G287))","v":""},{"$f":"IF(D287=D286,J286+1,1)","v":1},{"$f":"VLOOKUP(C287,'Kategorie - UPRAV ROK!'!$A$18:$C$21,3,FALSE)","v":2}]
["Nováčková Eliška",2012,"z",{"$f":"IF(B288=\"\",\"\",VLOOKUP('Kategorie - UPRAV ROK!'!$B$1-B288,'Kategorie - UPRAV ROK!'!$A$5:$G$13,OFFSET(B288,0,9)+3,TRUE))","v":"6 - MLADŠÍ DOROST - DÍVKY"},null,null,{"$f":"$N$14+F288/(60*24)","v":"10:00:00"},{"$f":"IF(ISERROR(VLOOKUP(E288,'Časy cíl'!$B$2:$C$252,2,FALSE)),\"\",VLOOKUP(E288,'Časy cíl'!$B$2:$C$252,2,FALSE))","v":""},{"$f":"IF(ISERROR(H288-G288),\"\",IF(H288=0,\"chybí čas\",H288-G288))","v":""},{"$f":"IF(D288=D287,J287+1,1)","v":2},{"$f":"VLOOKUP(C288,'Kategorie - UPRAV ROK!'!$A$18:$C$21,3,FALSE)","v":2}]
["Pešán Adam",2009,"m",{"$f":"IF(B289=\"\",\"\",VLOOKUP('Kategorie - UPRAV ROK!'!$B$1-B289,'Kategorie - UPRAV ROK!'!$A$5:$G$13,OFFSET(B289,0,9)+3,TRUE))","v":"7 - STARŠÍ DOROST"},53,23,{"$f":"$N$14+F289/(60*24)","v":"10:23:00"},{"$f":"IF(ISERROR(VLOOKUP(E289,'Časy cíl'!$B$2:$C$252,2,FALSE)),\"\",VLOOKUP(E289,'Časy cíl'!$B$2:$C$252,2,FALSE))","v":"10:26:11"},{"$f":"IF(ISERROR(H289-G289),\"\",IF(H289=0,\"chybí čas\",H289-G289))","v":"00:03:11"},{"$f":"IF(D289=D288,J288+1,1)","v":1},{"$f":"VLOOKUP(C289,'Kategorie - UPRAV ROK!'!$A$18:$C$21,3,FALSE)","v":1}]
["Hluchý Antonín",2010,"hm",{"$f":"IF(B290=\"\",\"\",VLOOKUP('Kategorie - UPRAV ROK!'!$B$1-B290,'Kategorie - UPRAV ROK!'!$A$5:$G$13,OFFSET(B290,0,9)+3,TRUE))","v":"7 - STARŠÍ DOROST"},54,23,{"$f":"$N$14+F290/(60*24)","v":"10:23:00"},{"$f":"IF(ISERROR(VLOOKUP(E290,'Časy cíl'!$B$2:$C$252,2,FALSE)),\"\",VLOOKUP(E290,'Časy cíl'!$B$2:$C$252,2,FALSE))","v":"10:26:15"},{"$f":"IF(ISERROR(H290-G290),\"\",IF(H290=0,\"chybí čas\",H290-G290))","v":"00:03:15"},{"$f":"IF(D290=D289,J289+1,1)","v":2},{"$f":"VLOOKUP(C290,'Kategorie - UPRAV ROK!'!$A$18:$C$21,3,FALSE)","v":3}]
["Muchka Antonín",2011,"m",{"$f":"IF(B291=\"\",\"\",VLOOKUP('Kategorie - UPRAV ROK!'!$B$1-B291,'Kategorie - UPRAV ROK!'!$A$5:$G$13,OFFSET(B291,0,9)+3,TRUE))","v":"7 - STARŠÍ DOROST"},52,23,{"$f":"$N$14+F291/(60*24)","v":"10:23:00"},{"$f":"IF(ISERROR(VLOOKUP(E291,'Časy cíl'!$B$2:$C$252,2,FALSE)),\"\",VLOOKUP(E291,'Časy cíl'!$B$2:$C$252,2,FALSE))","v":"10:26:23"},{"$f":"IF(ISERROR(H291-G291),\"\",IF(H291=0,\"chybí čas\",H291-G291))","v":"00:03:23"},{"$f":"IF(D291=D290,J290+1,1)","v":3},{"$f":"VLOOKUP(C291,'Kategorie - UPRAV ROK!'!$A$18:$C$21,3,FALSE)","v":1}]
["Kobek Radim",2011,"m",{"$f":"IF(B292=\"\",\"\",VLOOKUP('Kategorie - UPRAV ROK!'!$B$1-B292,'Kategorie - UPRAV ROK!'!$A$5:$G$13,OFFSET(B292,0,9)+3,TRUE))","v":"7 - STARŠÍ DOROST"},50,22,{"$f":"$N$14+F292/(60*24)","v":"10:22:00"},{"$f":"IF(ISERROR(VLOOKUP(E292,'Časy cíl'!$B$2:$C$252,2,FALSE)),\"\",VLOOKUP(E292,'Časy cíl'!$B$2:$C$252,2,FALSE))","v":"10:25:28"},{"$f":"IF(ISERROR(H292-G292),\"\",IF(H292=0,\"chybí čas\",H292-G292))","v":"00:03:28"},{"$f":"IF(D292=D291,J291+1,1)","v":4},{"$f":"VLOOKUP(C292,'Kategorie - UPRAV ROK!'!$A$18:$C$21,3,FALSE)","v":1}]
["Majdloch Matyas",2011,"m",{"$f":"IF(B293=\"\",\"\",VLOOKUP('Kategorie - UPRAV ROK!'!$B$1-B293,'Kategorie - UPRAV ROK!'!$A$5:$G$13,OFFSET(B293,0,9)+3,TRUE))","v":"7 - STARŠÍ DOROST"},51,22,{"$f":"$N$14+F293/(60*24)","v":"10:22:00"},{"$f":"IF(ISERROR(VLOOKUP(E293,'Časy cíl'!$B$2:$C$252,2,FALSE)),\"\",VLOOKUP(E293,'Časy cíl'!$B$2:$C$252,2,FALSE))","v":"10:25:52"},{"$f":"IF(ISERROR(H293-G293),\"\",IF(H293=0,\"chybí čas\",H293-G293))","v":"00:03:52"},{"$f":"IF(D293=D292,J292+1,1)","v":5},{"$f":"VLOOKUP(C293,'Kategorie - UPRAV ROK!'!$A$18:$C$21,3,FALSE)","v":1}]
["Gávelová Petra",1988,"z",{"$f":"IF(B294=\"\",\"\",VLOOKUP('Kategorie - UPRAV ROK!'!$B$1-B294,'Kategorie - UPRAV ROK!'!$A$5:$G$13,OFFSET(B294,0,9)+3,TRUE))","v":"8 - DOSPĚLAČKY"},56,24,{"$f":"$N$14+F294/(60*24)","v":"10:24:00"},{"$f":"IF(ISERROR(VLOOKUP(E294,'Časy cíl'!$B$2:$C$252,2,FALSE)),\"\",VLOOKUP(E294,'Časy cíl'!$B$2:$C$252,2,FALSE))","v":"10:27:54"},{"$f":"IF(ISERROR(H294-G294),\"\",IF(H294=0,\"chybí čas\",H294-G294))","v":"00:03:54"},{"$f":"IF(D294=D293,J293+1,1)","v":1},{"$f":"VLOOKUP(C294,'Kategorie - UPRAV ROK!'!$A$18:$C$21,3,FALSE)","v":2}]
["Tvarohová Renata",1994,"z",{"$f":"IF(B295=\"\",\"\",VLOOKUP('Kategorie - UPRAV ROK!'!$B$1-B295,'Kategorie - UPRAV ROK!'!$A$5:$G$13,OFFSET(B295,0,9)+3,TRUE))","v":"8 - DOSPĚLAČKY"},60,26,{"$f":"$N$14+F295/(60*24)","v":"10:26:00"},{"$f":"IF(ISERROR(VLOOKUP(E295,'Časy cíl'!$B$2:$C$252,2,FALSE)),\"\",VLOOKUP(E295,'Časy cíl'!$B$2:$C$252,2,FALSE))","v":"10:31:20"},{"$f":"IF(ISERROR(H295-G295),\"\",IF(H295=0,\"chybí čas\",H295-G295))","v":"00:05:20"},{"$f":"IF(D295=D294,J294+1,1)","v":2},{"$f":"VLOOKUP(C295,'Kategorie - UPRAV ROK!'!$A$18:$C$21,3,FALSE)","v":2}]
["Lukášková Adéla",2002,"z",{"$f":"IF(B296=\"\",\"\",VLOOKUP('Kategorie - UPRAV ROK!'!$B$1-B296,'Kategorie - UPRAV ROK!'!$A$5:$G$13,OFFSET(B296,0,9)+3,TRUE))","v":"8 - DOSPĚLAČKY"},57,25,{"$f":"$N$14+F296/(60*24)","v":"10:25:00"},{"$f":"IF(ISERROR(VLOOKUP(E296,'Časy cíl'!$B$2:$C$252,2,FALSE)),\"\",VLOOKUP(E296,'Časy cíl'!$B$2:$C$252,2,FALSE))","v":"10:30:21"},{"$f":"IF(ISERROR(H296-G296),\"\",IF(H296=0,\"chybí čas\",H296-G296))","v":"00:05:21"},{"$f":"IF(D296=D295,J295+1,1)","v":3},{"$f":"VLOOKUP(C296,'Kategorie - UPRAV ROK!'!$A$18:$C$21,3,FALSE)","v":2}]
["Berová Johana",2004,"z",{"$f":"IF(B297=\"\",\"\",VLOOKUP('Kategorie - UPRAV ROK!'!$B$1-B297,'Kategorie - UPRAV ROK!'!$A$5:$G$13,OFFSET(B297,0,9)+3,TRUE))","v":"8 - DOSPĚLAČKY"},55,24,{"$f":"$N$14+F297/(60*24)","v":"10:24:00"},{"$f":"IF(ISERROR(VLOOKUP(E297,'Časy cíl'!$B$2:$C$252,2,FALSE)),\"\",VLOOKUP(E297,'Časy cíl'!$B$2:$C$252,2,FALSE))","v":"10:29:27"},{"$f":"IF(ISERROR(H297-G297),\"\",IF(H297=0,\"chybí čas\",H297-G297))","v":"00:05:27"},{"$f":"IF(D297=D296,J296+1,1)","v":4},{"$f":"VLOOKUP(C297,'Kategorie - UPRAV ROK!'!$A$18:$C$21,3,FALSE)","v":2}]
["Semenská Romana",1987,"z",{"$f":"IF(B298=\"\",\"\",VLOOKUP('Kategorie - UPRAV ROK!'!$B$1-B298,'Kategorie - UPRAV ROK!'!$A$5:$G$13,OFFSET(B298,0,9)+3,TRUE))","v":"8 - DOSPĚLAČKY"},58,25,{"$f":"$N$14+F298/(60*24)","v":"10:25:00"},{"$f":"IF(ISERROR(VLOOKUP(E298,'Časy cíl'!$B$2:$C$252,2,FALSE)),\"\",VLOOKUP(E298,'Časy cíl'!$B$2:$C$252,2,FALSE))","v":"10:30:39"},{"$f":"IF(ISERROR(H298-G298),\"\",IF(H298=0,\"chybí čas\",H298-G298))","v":"00:05:39"},{"$f":"IF(D298=D297,J297+1,1)","v":5},{"$f":"VLOOKUP(C298,'Kategorie - UPRAV ROK!'!$A$18:$C$21,3,FALSE)","v":2}]
["Švejdová Anna",2003,"z",{"$f":"IF(B299=\"\",\"\",VLOOKUP('Kategorie - UPRAV ROK!'!$B$1-B299,'Kategorie - UPRAV ROK!'!$A$5:$G$13,OFFSET(B299,0,9)+3,TRUE))","v":"8 - DOSPĚLAČKY"},59,26,{"$f":"$N$14+F299/(60*24)","v":"10:26:00"},{"$f":"IF(ISERROR(VLOOKUP(E299,'Časy cíl'!$B$2:$C$252,2,FALSE)),\"\",VLOOKUP(E299,'Časy cíl'!$B$2:$C$252,2,FALSE))","v":"10:32:02"},{"$f":"IF(ISERROR(H299-G299),\"\",IF(H299=0,\"chybí čas\",H299-G299))","v":"00:06:02"},{"$f":"IF(D299=D298,J298+1,1)","v":6},{"$f":"VLOOKUP(C299,'Kategorie - UPRAV ROK!'!$A$18:$C$21,3,FALSE)","v":2}]
["Čečelská Eva",1993,"z",{"$f":"IF(B300=\"\",\"\",VLOOKUP('Kategorie - UPRAV ROK!'!$B$1-B300,'Kategorie - UPRAV ROK!'!$A$5:$G$13,OFFSET(B300,0,9)+3,TRUE))","v":"8 - DOSPĚLAČKY"},null,null,{"$f":"$N$14+F300/(60*24)","v":"10:00:00"},{"$f":"IF(ISERROR(VLOOKUP(E300,'Časy cíl'!$B$2:$C$252,2,FALSE)),\"\",VLOOKUP(E300,'Časy cíl'!$B$2:$C$252,2,FALSE))","v":""},{"$f":"IF(ISERROR(H300-G300),\"\",IF(H300=0,\"chybí čas\",H300-G300))","v":""},{"$f":"IF(D300=D299,J299+1,1)","v":7},{"$f":"VLOOKUP(C300,'Kategorie - UPRAV ROK!'!$A$18:$C$21,3,FALSE)","v":2}]
["Mlčoch Bedřich",1994,"m",{"$f":"IF(B301=\"\",\"\",VLOOKUP('Kategorie - UPRAV ROK!'!$B$1-B301,'Kategorie - UPRAV ROK!'!$A$5:$G$13,OFFSET(B301,0,9)+3,TRUE))","v":"8 - DOSPĚLÍ"},68,30,{"$f":"$N$14+F301/(60*24)","v":"10:30:00"},{"$f":"IF(ISERROR(VLOOKUP(E301,'Časy cíl'!$B$2:$C$252,2,FALSE)),\"\",VLOOKUP(E301,'Časy cíl'!$B$2:$C$252,2,FALSE))","v":"10:32:54"},{"$f":"IF(ISERROR(H301-G301),\"\",IF(H301=0,\"chybí čas\",H301-G301))","v":"00:02:54"},{"$f":"IF(D301=D300,J300+1,1)","v":1},{"$f":"VLOOKUP(C301,'Kategorie - UPRAV ROK!'!$A$18:$C$21,3,FALSE)","v":1}]
["Čečelský Jakub",1992,"m",{"$f":"IF(B302=\"\",\"\",VLOOKUP('Kategorie - UPRAV ROK!'!$B$1-B302,'Kategorie - UPRAV ROK!'!$A$5:$G$13,OFFSET(B302,0,9)+3,TRUE))","v":"8 - DOSPĚLÍ"},61,34,{"$f":"$N$14+F302/(60*24)","v":"10:34:00"},{"$f":"IF(ISERROR(VLOOKUP(E302,'Časy cíl'!$B$2:$C$252,2,FALSE)),\"\",VLOOKUP(E302,'Časy cíl'!$B$2:$C$252,2,FALSE))","v":"10:37:05"},{"$f":"IF(ISERROR(H302-G302),\"\",IF(H302=0,\"chybí čas\",H302-G302))","v":"00:03:05"},{"$f":"IF(D302=D301,J301+1,1)","v":2},{"$f":"VLOOKUP(C302,'Kategorie - UPRAV ROK!'!$A$18:$C$21,3,FALSE)","v":1}]
["Šváb Jan",1991,"m",{"$f":"IF(B303=\"\",\"\",VLOOKUP('Kategorie - UPRAV ROK!'!$B$1-B303,'Kategorie - UPRAV ROK!'!$A$5:$G$13,OFFSET(B303,0,9)+3,TRUE))","v":"8 - DOSPĚLÍ"},74,33,{"$f":"$N$14+F303/(60*24)","v":"10:33:00"},{"$f":"IF(ISERROR(VLOOKUP(E303,'Časy cíl'!$B$2:$C$252,2,FALSE)),\"\",VLOOKUP(E303,'Časy cíl'!$B$2:$C$252,2,FALSE))","v":"10:36:06"},{"$f":"IF(ISERROR(H303-G303),\"\",IF(H303=0,\"chybí čas\",H303-G303))","v":"00:03:06"},{"$f":"IF(D303=D302,J302+1,1)","v":3},{"$f":"VLOOKUP(C303,'Kategorie - UPRAV ROK!'!$A$18:$C$21,3,FALSE)","v":1}]
["Šlégl Jiří",1992,"m",{"$f":"IF(B304=\"\",\"\",VLOOKUP('Kategorie - UPRAV ROK!'!$B$1-B304,'Kategorie - UPRAV ROK!'!$A$5:$G$13,OFFSET(B304,0,9)+3,TRUE))","v":"8 - DOSPĚLÍ"},71,31,{"$f":"$N$14+F304/(60*24)","v":"10:31:00"},{"$f":"IF(ISERROR(VLOOKUP(E304,'Časy cíl'!$B$2:$C$252,2,FALSE)),\"\",VLOOKUP(E304,'Časy cíl'!$B$2:$C$252,2,FALSE))","v":"10:34:12"},{"$f":"IF(ISERROR(H304-G304),\"\",IF(H304=0,\"chybí čas\",H304-G304))","v":"00:03:12"},{"$f":"IF(D304=D303,J303+1,1)","v":4},{"$f":"VLOOKUP(C304,'Kategorie - UPRAV ROK!'!$A$18:$C$21,3,FALSE)","v":1}]
["Madecki Lukáš",1990,"m",{"$f":"IF(B305=\"\",\"\",VLOOKUP('Kategorie - UPRAV ROK!'!$B$1-B305,'Kategorie - UPRAV ROK!'!$A$5:$G$13,OFFSET(B305,0,9)+3,TRUE))","v":"8 - DOSPĚLÍ"},67,29,{"$f":"$N$14+F305/(60*24)","v":"10:29:00"},{"$f":"IF(ISERROR(VLOOKUP(E305,'Časy cíl'!$B$2:$C$252,2,FALSE)),\"\",VLOOKUP(E305,'Časy cíl'!$B$2:$C$252,2,FALSE))","v":"10:32:26"},{"$f":"IF(ISERROR(H305-G305),\"\",IF(H305=0,\"chybí čas\",H305-G305))","v":"00:03:26"},{"$f":"IF(D305=D304,J304+1,1)","v":5},{"$f":"VLOOKUP(C305,'Kategorie - UPRAV ROK!'!$A$18:$C$21,3,FALSE)","v":1}]
["Semenský Martin",1987,"m",{"$f":"IF(B306=\"\",\"\",VLOOKUP('Kategorie - UPRAV ROK!'!$B$1-B306,'Kategorie - UPRAV ROK!'!$A$5:$G$13,OFFSET(B306,0,9)+3,TRUE))","v":"8 - DOSPĚLÍ"},70,31,{"$f":"$N$14+F306/(60*24)","v":"10:31:00"},{"$f":"IF(ISERROR(VLOOKUP(E306,'Časy cíl'!$B$2:$C$252,2,FALSE)),\"\",VLOOKUP(E306,'Časy cíl'!$B$2:$C$252,2,FALSE))","v":"10:34:31"},{"$f":"IF(ISERROR(H306-G306),\"\",IF(H306=0,\"chybí čas\",H306-G306))","v":"00:03:31"},{"$f":"IF(D306=D305,J305+1,1)","v":6},{"$f":"VLOOKUP(C306,'Kategorie - UPRAV ROK!'!$A$18:$C$21,3,FALSE)","v":1}]
["Vancl Jan",1994,"m",{"$f":"IF(B307=\"\",\"\",VLOOKUP('Kategorie - UPRAV ROK!'!$B$1-B307,'Kategorie - UPRAV ROK!'!$A$5:$G$13,OFFSET(B307,0,9)+3,TRUE))","v":"8 - DOSPĚLÍ"},73,32,{"$f":"$N$14+F307/(60*24)","v":"10:32:00"},{"$f":"IF(ISERROR(VLOOKUP(E307,'Časy cíl'!$B$2:$C$252,2,FALSE)),\"\",VLOOKUP(E307,'Časy cíl'!$B$2:$C$252,2,FALSE))","v":"10:35:38"},{"$f":"IF(ISERROR(H307-G307),\"\",IF(H307=0,\"chybí čas\",H307-G307))","v":"00:03:38"},{"$f":"IF(D307=D306,J306+1,1)","v":7},{"$f":"VLOOKUP(C307,'Kategorie - UPRAV ROK!'!$A$18:$C$21,3,FALSE)","v":1}]
["Hisler Adam",2007,"m",{"$f":"IF(B308=\"\",\"\",VLOOKUP('Kategorie - UPRAV ROK!'!$B$1-B308,'Kategorie - UPRAV ROK!'!$A$5:$G$13,OFFSET(B308,0,9)+3,TRUE))","v":"8 - DOSPĚLÍ"},63,27,{"$f":"$N$14+F308/(60*24)","v":"10:27:00"},{"$f":"IF(ISERROR(VLOOKUP(E308,'Časy cíl'!$B$2:$C$252,2,FALSE)),\"\",VLOOKUP(E308,'Časy cíl'!$B$2:$C$252,2,FALSE))","v":"10:30:51"},{"$f":"IF(ISERROR(H308-G308),\"\",IF(H308=0,\"chybí čas\",H308-G308))","v":"00:03:51"},{"$f":"IF(D308=D307,J307+1,1)","v":8},{"$f":"VLOOKUP(C308,'Kategorie - UPRAV ROK!'!$A$18:$C$21,3,FALSE)","v":1}]
["Pálka Martin",1992,"m",{"$f":"IF(B309=\"\",\"\",VLOOKUP('Kategorie - UPRAV ROK!'!$B$1-B309,'Kategorie - UPRAV ROK!'!$A$5:$G$13,OFFSET(B309,0,9)+3,TRUE))","v":"8 - DOSPĚLÍ"},69,30,{"$f":"$N$14+F309/(60*24)","v":"10:30:00"},{"$f":"IF(ISERROR(VLOOKUP(E309,'Časy cíl'!$B$2:$C$252,2,FALSE)),\"\",VLOOKUP(E309,'Časy cíl'!$B$2:$C$252,2,FALSE))","v":"10:34:01"},{"$f":"IF(ISERROR(H309-G309),\"\",IF(H309=0,\"chybí čas\",H309-G309))","v":"00:04:01"},{"$f":"IF(D309=D308,J308+1,1)","v":9},{"$f":"VLOOKUP(C309,'Kategorie - UPRAV ROK!'!$A$18:$C$21,3,FALSE)","v":1}]
["Hájek Petr",1987,"m",{"$f":"IF(B310=\"\",\"\",VLOOKUP('Kategorie - UPRAV ROK!'!$B$1-B310,'Kategorie - UPRAV ROK!'!$A$5:$G$13,OFFSET(B310,0,9)+3,TRUE))","v":"8 - DOSPĚLÍ"},62,27,{"$f":"$N$14+F310/(60*24)","v":"10:27:00"},{"$f":"IF(ISERROR(VLOOKUP(E310,'Časy cíl'!$B$2:$C$252,2,FALSE)),\"\",VLOOKUP(E310,'Časy cíl'!$B$2:$C$252,2,FALSE))","v":"10:31:02"},{"$f":"IF(ISERROR(H310-G310),\"\",IF(H310=0,\"chybí čas\",H310-G310))","v":"00:04:02"},{"$f":"IF(D310=D309,J309+1,1)","v":10},{"$f":"VLOOKUP(C310,'Kategorie - UPRAV ROK!'!$A$18:$C$21,3,FALSE)","v":1}]
["Kopriva Martin",1989,"m",{"$f":"IF(B311=\"\",\"\",VLOOKUP('Kategorie - UPRAV ROK!'!$B$1-B311,'Kategorie - UPRAV ROK!'!$A$5:$G$13,OFFSET(B311,0,9)+3,TRUE))","v":"8 - DOSPĚLÍ"},64,28,{"$f":"$N$14+F311/(60*24)","v":"10:28:00"},{"$f":"IF(ISERROR(VLOOKUP(E311,'Časy cíl'!$B$2:$C$252,2,FALSE)),\"\",VLOOKUP(E311,'Časy cíl'!$B$2:$C$252,2,FALSE))","v":"10:32:04"},{"$f":"IF(ISERROR(H311-G311),\"\",IF(H311=0,\"chybí čas\",H311-G311))","v":"00:04:04"},{"$f":"IF(D311=D310,J310+1,1)","v":11},{"$f":"VLOOKUP(C311,'Kategorie - UPRAV ROK!'!$A$18:$C$21,3,FALSE)","v":1}]
["Holas Václav",1986,"m",{"$f":"IF(B312=\"\",\"\",VLOOKUP('Kategorie - UPRAV ROK!'!$B$1-B312,'Kategorie - UPRAV ROK!'!$A$5:$G$13,OFFSET(B312,0,9)+3,TRUE))","v":"8 - DOSPĚLÍ"},75,33,{"$f":"$N$14+F312/(60*24)","v":"10:33:00"},{"$f":"IF(ISERROR(VLOOKUP(E312,'Časy cíl'!$B$2:$C$252,2,FALSE)),\"\",VLOOKUP(E312,'Časy cíl'!$B$2:$C$252,2,FALSE))","v":"10:37:07"},{"$f":"IF(ISERROR(H312-G312),\"\",IF(H312=0,\"chybí čas\",H312-G312))","v":"00:04:07"},{"$f":"IF(D312=D311,J311+1,1)","v":12},{"$f":"VLOOKUP(C312,'Kategorie - UPRAV ROK!'!$A$18:$C$21,3,FALSE)","v":1}]
["Kratochvíl Tomáš",1990,"m",{"$f":"IF(B313=\"\",\"\",VLOOKUP('Kategorie - UPRAV ROK!'!$B$1-B313,'Kategorie - UPRAV ROK!'!$A$5:$G$13,OFFSET(B313,0,9)+3,TRUE))","v":"8 - DOSPĚLÍ"},65,28,{"$f":"$N$14+F313/(60*24)","v":"10:28:00"},{"$f":"IF(ISERROR(VLOOKUP(E313,'Časy cíl'!$B$2:$C$252,2,FALSE)),\"\",VLOOKUP(E313,'Časy cíl'!$B$2:$C$252,2,FALSE))","v":"10:32:13"},{"$f":"IF(ISERROR(H313-G313),\"\",IF(H313=0,\"chybí čas\",H313-G313))","v":"00:04:13"},{"$f":"IF(D313=D312,J312+1,1)","v":13},{"$f":"VLOOKUP(C313,'Kategorie - UPRAV ROK!'!$A$18:$C$21,3,FALSE)","v":1}]
["Kundrát Adam",1986,"m",{"$f":"IF(B314=\"\",\"\",VLOOKUP('Kategorie - UPRAV ROK!'!$B$1-B314,'Kategorie - UPRAV ROK!'!$A$5:$G$13,OFFSET(B314,0,9)+3,TRUE))","v":"8 - DOSPĚLÍ"},66,29,{"$f":"$N$14+F314/(60*24)","v":"10:29:00"},{"$f":"IF(ISERROR(VLOOKUP(E314,'Časy cíl'!$B$2:$C$252,2,FALSE)),\"\",VLOOKUP(E314,'Časy cíl'!$B$2:$C$252,2,FALSE))","v":"10:33:16"},{"$f":"IF(ISERROR(H314-G314),\"\",IF(H314=0,\"chybí čas\",H314-G314))","v":"00:04:16"},{"$f":"IF(D314=D313,J313+1,1)","v":14},{"$f":"VLOOKUP(C314,'Kategorie - UPRAV ROK!'!$A$18:$C$21,3,FALSE)","v":1}]
["Tesař Roman",1990,"m",{"$f":"IF(B315=\"\",\"\",VLOOKUP('Kategorie - UPRAV ROK!'!$B$1-B315,'Kategorie - UPRAV ROK!'!$A$5:$G$13,OFFSET(B315,0,9)+3,TRUE))","v":"8 - DOSPĚLÍ"},72,32,{"$f":"$N$14+F315/(60*24)","v":"10:32:00"},{"$f":"IF(ISERROR(VLOOKUP(E315,'Časy cíl'!$B$2:$C$252,2,FALSE)),\"\",VLOOKUP(E315,'Časy cíl'!$B$2:$C$252,2,FALSE))","v":"10:36:38"},{"$f":"IF(ISERROR(H315-G315),\"\",IF(H315=0,\"chybí čas\",H315-G315))","v":"00:04:38"},{"$f":"IF(D315=D314,J314+1,1)","v":15},{"$f":"VLOOKUP(C315,'Kategorie - UPRAV ROK!'!$A$18:$C$21,3,FALSE)","v":1}]
["Hlaváček Jakub",1996,"m",{"$f":"IF(B316=\"\",\"\",VLOOKUP('Kategorie - UPRAV ROK!'!$B$1-B316,'Kategorie - UPRAV ROK!'!$A$5:$G$13,OFFSET(B316,0,9)+3,TRUE))","v":"8 - DOSPĚLÍ"},null,null,{"$f":"$N$14+F316/(60*24)","v":"10:00:00"},{"$f":"IF(ISERROR(VLOOKUP(E316,'Časy cíl'!$B$2:$C$252,2,FALSE)),\"\",VLOOKUP(E316,'Časy cíl'!$B$2:$C$252,2,FALSE))","v":""},{"$f":"IF(ISERROR(H316-G316),\"\",IF(H316=0,\"chybí čas\",H316-G316))","v":""},{"$f":"IF(D316=D315,J315+1,1)","v":16},{"$f":"VLOOKUP(C316,'Kategorie - UPRAV ROK!'!$A$18:$C$21,3,FALSE)","v":1}]
["Hnilička Martin",1981,"m",{"$f":"IF(B317=\"\",\"\",VLOOKUP('Kategorie - UPRAV ROK!'!$B$1-B317,'Kategorie - UPRAV ROK!'!$A$5:$G$13,OFFSET(B317,0,9)+3,TRUE))","v":"9 - VETERÁNI"},77,34,{"$f":"$N$14+F317/(60*24)","v":"10:34:00"},{"$f":"IF(ISERROR(VLOOKUP(E317,'Časy cíl'!$B$2:$C$252,2,FALSE)),\"\",VLOOKUP(E317,'Časy cíl'!$B$2:$C$252,2,FALSE))","v":"10:37:13"},{"$f":"IF(ISERROR(H317-G317),\"\",IF(H317=0,\"chybí čas\",H317-G317))","v":"00:03:13"},{"$f":"IF(D317=D316,J316+1,1)","v":1},{"$f":"VLOOKUP(C317,'Kategorie - UPRAV ROK!'!$A$18:$C$21,3,FALSE)","v":1}]
["Menzel Dan",1985,"m",{"$f":"IF(B318=\"\",\"\",VLOOKUP('Kategorie - UPRAV ROK!'!$B$1-B318,'Kategorie - UPRAV ROK!'!$A$5:$G$13,OFFSET(B318,0,9)+3,TRUE))","v":"9 - VETERÁNI"},81,36,{"$f":"$N$14+F318/(60*24)","v":"10:36:00"},{"$f":"IF(ISERROR(VLOOKUP(E318,'Časy cíl'!$B$2:$C$252,2,FALSE)),\"\",VLOOKUP(E318,'Časy cíl'!$B$2:$C$252,2,FALSE))","v":"10:39:28"},{"$f":"IF(ISERROR(H318-G318),\"\",IF(H318=0,\"chybí čas\",H318-G318))","v":"00:03:28"},{"$f":"IF(D318=D317,J317+1,1)","v":2},{"$f":"VLOOKUP(C318,'Kategorie - UPRAV ROK!'!$A$18:$C$21,3,FALSE)","v":1}]
["Kautzký Tomáš",1976,"m",{"$f":"IF(B319=\"\",\"\",VLOOKUP('Kategorie - UPRAV ROK!'!$B$1-B319,'Kategorie - UPRAV ROK!'!$A$5:$G$13,OFFSET(B319,0,9)+3,TRUE))","v":"9 - VETERÁNI"},78,0,{"$f":"$N$14+F319/(60*24)","v":"10:00:00"},{"$f":"IF(ISERROR(VLOOKUP(E319,'Časy cíl'!$B$2:$C$252,2,FALSE)),\"\",VLOOKUP(E319,'Časy cíl'!$B$2:$C$252,2,FALSE))","v":"10:03:32"},{"$f":"IF(ISERROR(H319-G319),\"\",IF(H319=0,\"chybí čas\",H319-G319))","v":"00:03:32"},{"$f":"IF(D319=D318,J318+1,1)","v":3},{"$f":"VLOOKUP(C319,'Kategorie - UPRAV ROK!'!$A$18:$C$21,3,FALSE)","v":1}]
["Hájek Jan",1985,"m",{"$f":"IF(B320=\"\",\"\",VLOOKUP('Kategorie - UPRAV ROK!'!$B$1-B320,'Kategorie - UPRAV ROK!'!$A$5:$G$13,OFFSET(B320,0,9)+3,TRUE))","v":"9 - VETERÁNI"},76,34,{"$f":"$N$14+F320/(60*24)","v":"10:34:00"},{"$f":"IF(ISERROR(VLOOKUP(E320,'Časy cíl'!$B$2:$C$252,2,FALSE)),\"\",VLOOKUP(E320,'Časy cíl'!$B$2:$C$252,2,FALSE))","v":"10:37:34"},{"$f":"IF(ISERROR(H320-G320),\"\",IF(H320=0,\"chybí čas\",H320-G320))","v":"00:03:34"},{"$f":"IF(D320=D319,J319+1,1)","v":4},{"$f":"VLOOKUP(C320,'Kategorie - UPRAV ROK!'!$A$18:$C$21,3,FALSE)","v":1}]
["Wiedeman René",1973,"m",{"$f":"IF(B321=\"\",\"\",VLOOKUP('Kategorie - UPRAV ROK!'!$B$1-B321,'Kategorie - UPRAV ROK!'!$A$5:$G$13,OFFSET(B321,0,9)+3,TRUE))","v":"9 - VETERÁNI"},88,39,{"$f":"$N$14+F321/(60*24)","v":"10:39:00"},{"$f":"IF(ISERROR(VLOOKUP(E321,'Časy cíl'!$B$2:$C$252,2,FALSE)),\"\",VLOOKUP(E321,'Časy cíl'!$B$2:$C$252,2,FALSE))","v":"10:42:39"},{"$f":"IF(ISERROR(H321-G321),\"\",IF(H321=0,\"chybí čas\",H321-G321))","v":"00:03:39"},{"$f":"IF(D321=D320,J320+1,1)","v":5},{"$f":"VLOOKUP(C321,'Kategorie - UPRAV ROK!'!$A$18:$C$21,3,FALSE)","v":1}]
["Štafl Karel",1983,"m",{"$f":"IF(B322=\"\",\"\",VLOOKUP('Kategorie - UPRAV ROK!'!$B$1-B322,'Kategorie - UPRAV ROK!'!$A$5:$G$13,OFFSET(B322,0,9)+3,TRUE))","v":"9 - VETERÁNI"},85,38,{"$f":"$N$14+F322/(60*24)","v":"10:38:00"},{"$f":"IF(ISERROR(VLOOKUP(E322,'Časy cíl'!$B$2:$C$252,2,FALSE)),\"\",VLOOKUP(E322,'Časy cíl'!$B$2:$C$252,2,FALSE))","v":"10:41:50"},{"$f":"IF(ISERROR(H322-G322),\"\",IF(H322=0,\"chybí čas\",H322-G322))","v":"00:03:50"},{"$f":"IF(D322=D321,J321+1,1)","v":6},{"$f":"VLOOKUP(C322,'Kategorie - UPRAV ROK!'!$A$18:$C$21,3,FALSE)","v":1}]
["Vopat Václav",1984,"m",{"$f":"IF(B323=\"\",\"\",VLOOKUP('Kategorie - UPRAV ROK!'!$B$1-B323,'Kategorie - UPRAV ROK!'!$A$5:$G$13,OFFSET(B323,0,9)+3,TRUE))","v":"9 - VETERÁNI"},87,39,{"$f":"$N$14+F323/(60*24)","v":"10:39:00"},{"$f":"IF(ISERROR(VLOOKUP(E323,'Časy cíl'!$B$2:$C$252,2,FALSE)),\"\",VLOOKUP(E323,'Časy cíl'!$B$2:$C$252,2,FALSE))","v":"10:42:51"},{"$f":"IF(ISERROR(H323-G323),\"\",IF(H323=0,\"chybí čas\",H323-G323))","v":"00:03:51"},{"$f":"IF(D323=D322,J322+1,1)","v":7},{"$f":"VLOOKUP(C323,'Kategorie - UPRAV ROK!'!$A$18:$C$21,3,FALSE)","v":1}]
["Štafl Václav",1981,"m",{"$f":"IF(B324=\"\",\"\",VLOOKUP('Kategorie - UPRAV ROK!'!$B$1-B324,'Kategorie - UPRAV ROK!'!$A$5:$G$13,OFFSET(B324,0,9)+3,TRUE))","v":"9 - VETERÁNI"},86,38,{"$f":"$N$14+F324/(60*24)","v":"10:38:00"},{"$f":"IF(ISERROR(VLOOKUP(E324,'Časy cíl'!$B$2:$C$252,2,FALSE)),\"\",VLOOKUP(E324,'Časy cíl'!$B$2:$C$252,2,FALSE))","v":"10:41:52"},{"$f":"IF(ISERROR(H324-G324),\"\",IF(H324=0,\"chybí čas\",H324-G324))","v":"00:03:52"},{"$f":"IF(D324=D323,J323+1,1)","v":8},{"$f":"VLOOKUP(C324,'Kategorie - UPRAV ROK!'!$A$18:$C$21,3,FALSE)","v":1}]
["Novomestský Marcel",1985,"m",{"$f":"IF(B325=\"\",\"\",VLOOKUP('Kategorie - UPRAV ROK!'!$B$1-B325,'Kategorie - UPRAV ROK!'!$A$5:$G$13,OFFSET(B325,0,9)+3,TRUE))","v":"9 - VETERÁNI"},83,37,{"$f":"$N$14+F325/(60*24)","v":"10:37:00"},{"$f":"IF(ISERROR(VLOOKUP(E325,'Časy cíl'!$B$2:$C$252,2,FALSE)),\"\",VLOOKUP(E325,'Časy cíl'!$B$2:$C$252,2,FALSE))","v":"10:41:05"},{"$f":"IF(ISERROR(H325-G325),\"\",IF(H325=0,\"chybí čas\",H325-G325))","v":"00:04:05"},{"$f":"IF(D325=D324,J324+1,1)","v":9},{"$f":"VLOOKUP(C325,'Kategorie - UPRAV ROK!'!$A$18:$C$21,3,FALSE)","v":1}]
["Kobek Josef",1977,"m",{"$f":"IF(B326=\"\",\"\",VLOOKUP('Kategorie - UPRAV ROK!'!$B$1-B326,'Kategorie - UPRAV ROK!'!$A$5:$G$13,OFFSET(B326,0,9)+3,TRUE))","v":"9 - VETERÁNI"},79,35,{"$f":"$N$14+F326/(60*24)","v":"10:35:00"},{"$f":"IF(ISERROR(VLOOKUP(E326,'Časy cíl'!$B$2:$C$252,2,FALSE)),\"\",VLOOKUP(E326,'Časy cíl'!$B$2:$C$252,2,FALSE))","v":"10:39:19"},{"$f":"IF(ISERROR(H326-G326),\"\",IF(H326=0,\"chybí čas\",H326-G326))","v":"00:04:19"},{"$f":"IF(D326=D325,J325+1,1)","v":10},{"$f":"VLOOKUP(C326,'Kategorie - UPRAV ROK!'!$A$18:$C$21,3,FALSE)","v":1}]
["Lukášek Jiří",1956,"m",{"$f":"IF(B327=\"\",\"\",VLOOKUP('Kategorie - UPRAV ROK!'!$B$1-B327,'Kategorie - UPRAV ROK!'!$A$5:$G$13,OFFSET(B327,0,9)+3,TRUE))","v":"9 - VETERÁNI"},80,35,{"$f":"$N$14+F327/(60*24)","v":"10:35:00"},{"$f":"IF(ISERROR(VLOOKUP(E327,'Časy cíl'!$B$2:$C$252,2,FALSE)),\"\",VLOOKUP(E327,'Časy cíl'!$B$2:$C$252,2,FALSE))","v":"10:40:08"},{"$f":"IF(ISERROR(H327-G327),\"\",IF(H327=0,\"chybí čas\",H327-G327))","v":"00:05:08"},{"$f":"IF(D327=D326,J326+1,1)","v":11},{"$f":"VLOOKUP(C327,'Kategorie - UPRAV ROK!'!$A$18:$C$21,3,FALSE)","v":1}]
["Grolmus Miloslav",1972,"m",{"$f":"IF(B328=\"\",\"\",VLOOKUP('Kategorie - UPRAV ROK!'!$B$1-B328,'Kategorie - UPRAV ROK!'!$A$5:$G$13,OFFSET(B328,0,9)+3,TRUE))","v":"9 - VETERÁNI"},89,39,{"$f":"$N$14+F328/(60*24)","v":"10:39:00"},{"$f":"IF(ISERROR(VLOOKUP(E328,'Časy cíl'!$B$2:$C$252,2,FALSE)),\"\",VLOOKUP(E328,'Časy cíl'!$B$2:$C$252,2,FALSE))","v":"10:44:12"},{"$f":"IF(ISERROR(H328-G328),\"\",IF(H328=0,\"chybí čas\",H328-G328))","v":"00:05:12"},{"$f":"IF(D328=D327,J327+1,1)","v":12},{"$f":"VLOOKUP(C328,'Kategorie - UPRAV ROK!'!$A$18:$C$21,3,FALSE)","v":1}]
["Novák Michal",1978,"m",{"$f":"IF(B329=\"\",\"\",VLOOKUP('Kategorie - UPRAV ROK!'!$B$1-B329,'Kategorie - UPRAV ROK!'!$A$5:$G$13,OFFSET(B329,0,9)+3,TRUE))","v":"9 - VETERÁNI"},82,36,{"$f":"$N$14+F329/(60*24)","v":"10:36:00"},{"$f":"IF(ISERROR(VLOOKUP(E329,'Časy cíl'!$B$2:$C$252,2,FALSE)),\"\",VLOOKUP(E329,'Časy cíl'!$B$2:$C$252,2,FALSE))","v":"10:41:24"},{"$f":"IF(ISERROR(H329-G329),\"\",IF(H329=0,\"chybí čas\",H329-G329))","v":"00:05:24"},{"$f":"IF(D329=D328,J328+1,1)","v":13},{"$f":"VLOOKUP(C329,'Kategorie - UPRAV ROK!'!$A$18:$C$21,3,FALSE)","v":1}]
["Petr Václav",1980,"m",{"$f":"IF(B330=\"\",\"\",VLOOKUP('Kategorie - UPRAV ROK!'!$B$1-B330,'Kategorie - UPRAV ROK!'!$A$5:$G$13,OFFSET(B330,0,9)+3,TRUE))","v":"9 - VETERÁNI"},84,37,{"$f":"$N$14+F330/(60*24)","v":"10:37:00"},{"$f":"IF(ISERROR(VLOOKUP(E330,'Časy cíl'!$B$2:$C$252,2,FALSE)),\"\",VLOOKUP(E330,'Časy cíl'!$B$2:$C$252,2,FALSE))","v":"10:45:42"},{"$f":"IF(ISERROR(H330-G330),\"\",IF(H330=0,\"chybí čas\",H330-G330))","v":"00:08:42"},{"$f":"IF(D330=D329,J329+1,1)","v":14},{"$f":"VLOOKUP(C330,'Kategorie - UPRAV ROK!'!$A$18:$C$21,3,FALSE)","v":1}]
["Ptáčková Radka",1971,"z",{"$f":"IF(B331=\"\",\"\",VLOOKUP('Kategorie - UPRAV ROK!'!$B$1-B331,'Kategorie - UPRAV ROK!'!$A$5:$G$13,OFFSET(B331,0,9)+3,TRUE))","v":"9 - VETERÁNKY"},91,40,{"$f":"$N$14+F331/(60*24)","v":"10:40:00"},{"$f":"IF(ISERROR(VLOOKUP(E331,'Časy cíl'!$B$2:$C$252,2,FALSE)),\"\",VLOOKUP(E331,'Časy cíl'!$B$2:$C$252,2,FALSE))","v":"10:45:14"},{"$f":"IF(ISERROR(H331-G331),\"\",IF(H331=0,\"chybí čas\",H331-G331))","v":"00:05:14"},{"$f":"IF(D331=D330,J330+1,1)","v":1},{"$f":"VLOOKUP(C331,'Kategorie - UPRAV ROK!'!$A$18:$C$21,3,FALSE)","v":2}]
["Štaflová Dagmar",1982,"z",{"$f":"IF(B332=\"\",\"\",VLOOKUP('Kategorie - UPRAV ROK!'!$B$1-B332,'Kategorie - UPRAV ROK!'!$A$5:$G$13,OFFSET(B332,0,9)+3,TRUE))","v":"9 - VETERÁNKY"},93,41,{"$f":"$N$14+F332/(60*24)","v":"10:41:00"},{"$f":"IF(ISERROR(VLOOKUP(E332,'Časy cíl'!$B$2:$C$252,2,FALSE)),\"\",VLOOKUP(E332,'Časy cíl'!$B$2:$C$252,2,FALSE))","v":"10:46:41"},{"$f":"IF(ISERROR(H332-G332),\"\",IF(H332=0,\"chybí čas\",H332-G332))","v":"00:05:41"},{"$f":"IF(D332=D331,J331+1,1)","v":2},{"$f":"VLOOKUP(C332,'Kategorie - UPRAV ROK!'!$A$18:$C$21,3,FALSE)","v":2}]
["Štaflová Blanka",1985,"z",{"$f":"IF(B333=\"\",\"\",VLOOKUP('Kategorie - UPRAV ROK!'!$B$1-B333,'Kategorie - UPRAV ROK!'!$A$5:$G$13,OFFSET(B333,0,9)+3,TRUE))","v":"9 - VETERÁNKY"},92,41,{"$f":"$N$14+F333/(60*24)","v":"10:41:00"},{"$f":"IF(ISERROR(VLOOKUP(E333,'Časy cíl'!$B$2:$C$252,2,FALSE)),\"\",VLOOKUP(E333,'Časy cíl'!$B$2:$C$252,2,FALSE))","v":"10:47:06"},{"$f":"IF(ISERROR(H333-G333),\"\",IF(H333=0,\"chybí čas\",H333-G333))","v":"00:06:06"},{"$f":"IF(D333=D332,J332+1,1)","v":3},{"$f":"VLOOKUP(C333,'Kategorie - UPRAV ROK!'!$A$18:$C$21,3,FALSE)","v":2}]
["Müllerová Hana",1953,"z",{"$f":"IF(B334=\"\",\"\",VLOOKUP('Kategorie - UPRAV ROK!'!$B$1-B334,'Kategorie - UPRAV ROK!'!$A$5:$G$13,OFFSET(B334,0,9)+3,TRUE))","v":"9 - VETERÁNKY"},90,40,{"$f":"$N$14+F334/(60*24)","v":"10:40:00"},{"$f":"IF(ISERROR(VLOOKUP(E334,'Časy cíl'!$B$2:$C$252,2,FALSE)),\"\",VLOOKUP(E334,'Časy cíl'!$B$2:$C$252,2,FALSE))","v":"10:52:16"},{"$f":"IF(ISERROR(H334-G334),\"\",IF(H334=0,\"chybí čas\",H334-G334))","v":"00:12:16"},{"$f":"IF(D334=D333,J333+1,1)","v":4},{"$f":"VLOOKUP(C334,'Kategorie - UPRAV ROK!'!$A$18:$C$21,3,FALSE)","v":2}]
["Nováčková Michaela",1984,"z",{"$f":"IF(B335=\"\",\"\",VLOOKUP('Kategorie - UPRAV ROK!'!$B$1-B335,'Kategorie - UPRAV ROK!'!$A$5:$G$13,OFFSET(B335,0,9)+3,TRUE))","v":"9 - VETERÁNKY"},null,null,{"$f":"$N$14+F335/(60*24)","v":"10:00:00"},{"$f":"IF(ISERROR(VLOOKUP(E335,'Časy cíl'!$B$2:$C$252,2,FALSE)),\"\",VLOOKUP(E335,'Časy cíl'!$B$2:$C$252,2,FALSE))","v":""},{"$f":"IF(ISERROR(H335-G335),\"\",IF(H335=0,\"chybí čas\",H335-G335))","v":""},{"$f":"IF(D335=D334,J334+1,1)","v":5},{"$f":"VLOOKUP(C335,'Kategorie - UPRAV ROK!'!$A$18:$C$21,3,FALSE)","v":2}]
["Brzobohatý Tomáš",1990,"hm",{"$f":"IF(B336=\"\",\"\",VLOOKUP('Kategorie - UPRAV ROK!'!$B$1-B336,'Kategorie - UPRAV ROK!'!$A$5:$G$13,OFFSET(B336,0,9)+3,TRUE))","v":"X - HOROLEZCI"},94,42,{"$f":"$N$14+F336/(60*24)","v":"10:42:00"},{"$f":"IF(ISERROR(VLOOKUP(E336,'Časy cíl'!$B$2:$C$252,2,FALSE)),\"\",VLOOKUP(E336,'Časy cíl'!$B$2:$C$252,2,FALSE))","v":"10:45:30"},{"$f":"IF(ISERROR(H336-G336),\"\",IF(H336=0,\"chybí čas\",H336-G336))","v":"00:03:30"},{"$f":"IF(D336=D335,J335+1,1)","v":1},{"$f":"VLOOKUP(C336,'Kategorie - UPRAV ROK!'!$A$18:$C$21,3,FALSE)","v":3}]
["Svoboda Josef",1988,"hm",{"$f":"IF(B337=\"\",\"\",VLOOKUP('Kategorie - UPRAV ROK!'!$B$1-B337,'Kategorie - UPRAV ROK!'!$A$5:$G$13,OFFSET(B337,0,9)+3,TRUE))","v":"X - HOROLEZCI"},101,42,{"$f":"$N$14+F337/(60*24)","v":"10:42:00"},{"$f":"IF(ISERROR(VLOOKUP(E337,'Časy cíl'!$B$2:$C$252,2,FALSE)),\"\",VLOOKUP(E337,'Časy cíl'!$B$2:$C$252,2,FALSE))","v":"10:46:13"},{"$f":"IF(ISERROR(H337-G337),\"\",IF(H337=0,\"chybí čas\",H337-G337))","v":"00:04:13"},{"$f":"IF(D337=D336,J336+1,1)","v":2},{"$f":"VLOOKUP(C337,'Kategorie - UPRAV ROK!'!$A$18:$C$21,3,FALSE)","v":3}]
["Hrudka Ondřej ",1992,"hm",{"$f":"IF(B338=\"\",\"\",VLOOKUP('Kategorie - UPRAV ROK!'!$B$1-B338,'Kategorie - UPRAV ROK!'!$A$5:$G$13,OFFSET(B338,0,9)+3,TRUE))","v":"X - HOROLEZCI"},null,null,{"$f":"$N$14+F338/(60*24)","v":"10:00:00"},{"$f":"IF(ISERROR(VLOOKUP(E338,'Časy cíl'!$B$2:$C$252,2,FALSE)),\"\",VLOOKUP(E338,'Časy cíl'!$B$2:$C$252,2,FALSE))","v":""},{"$f":"IF(ISERROR(H338-G338),\"\",IF(H338=0,\"chybí čas\",H338-G338))","v":""},{"$f":"IF(D338=D337,J337+1,1)","v":3},{"$f":"VLOOKUP(C338,'Kategorie - UPRAV ROK!'!$A$18:$C$21,3,FALSE)","v":3}]
["Lencová Simona",1993,"hz",{"$f":"IF(B339=\"\",\"\",VLOOKUP('Kategorie - UPRAV ROK!'!$B$1-B339,'Kategorie - UPRAV ROK!'!$A$5:$G$13,OFFSET(B339,0,9)+3,TRUE))","v":"X - HOROLEZKYNĚ"},95,43,{"$f":"$N$14+F339/(60*24)","v":"10:43:00"},{"$f":"IF(ISERROR(VLOOKUP(E339,'Časy cíl'!$B$2:$C$252,2,FALSE)),\"\",VLOOKUP(E339,'Časy cíl'!$B$2:$C$252,2,FALSE))","v":"10:48:49"},{"$f":"IF(ISERROR(H339-G339),\"\",IF(H339=0,\"chybí čas\",H339-G339))","v":"00:05:49"},{"$f":"IF(D339=D338,J338+1,1)","v":1},{"$f":"VLOOKUP(C339,'Kategorie - UPRAV ROK!'!$A$18:$C$21,3,FALSE)","v":4}]
["Lišková Alena",1995,"hz",{"$f":"IF(B340=\"\",\"\",VLOOKUP('Kategorie - UPRAV ROK!'!$B$1-B340,'Kategorie - UPRAV ROK!'!$A$5:$G$13,OFFSET(B340,0,9)+3,TRUE))","v":"X - HOROLEZKYNĚ"},96,43,{"$f":"$N$14+F340/(60*24)","v":"10:43:00"},{"$f":"IF(ISERROR(VLOOKUP(E340,'Časy cíl'!$B$2:$C$252,2,FALSE)),\"\",VLOOKUP(E340,'Časy cíl'!$B$2:$C$252,2,FALSE))","v":"10:49:05"},{"$f":"IF(ISERROR(H340-G340),\"\",IF(H340=0,\"chybí čas\",H340-G340))","v":"00:06:05"},{"$f":"IF(D340=D339,J339+1,1)","v":2},{"$f":"VLOOKUP(C340,'Kategorie - UPRAV ROK!'!$A$18:$C$21,3,FALSE)","v":4}]
["Gável Luboš",1984,"hm",{"$f":"IF(B341=\"\",\"\",VLOOKUP('Kategorie - UPRAV ROK!'!$B$1-B341,'Kategorie - UPRAV ROK!'!$A$5:$G$13,OFFSET(B341,0,9)+3,TRUE))","v":"XI - HOROLEZCI VETERÁNI"},151,45,{"$f":"$N$14+F341/(60*24)","v":"10:45:00"},{"$f":"IF(ISERROR(VLOOKUP(E341,'Časy cíl'!$B$2:$C$252,2,FALSE)),\"\",VLOOKUP(E341,'Časy cíl'!$B$2:$C$252,2,FALSE))","v":"10:48:04"},{"$f":"IF(ISERROR(H341-G341),\"\",IF(H341=0,\"chybí čas\",H341-G341))","v":"00:03:04"},{"$f":"IF(D341=D340,J340+1,1)","v":1},{"$f":"VLOOKUP(C341,'Kategorie - UPRAV ROK!'!$A$18:$C$21,3,FALSE)","v":3}]
["Ýksvorávs Divad",1977,"hm",{"$f":"IF(B342=\"\",\"\",VLOOKUP('Kategorie - UPRAV ROK!'!$B$1-B342,'Kategorie - UPRAV ROK!'!$A$5:$G$13,OFFSET(B342,0,9)+3,TRUE))","v":"XI - HOROLEZCI VETERÁNI"},100,0,{"$f":"$N$14+F342/(60*24)","v":"10:00:00"},{"$f":"IF(ISERROR(VLOOKUP(E342,'Časy cíl'!$B$2:$C$252,2,FALSE)),\"\",VLOOKUP(E342,'Časy cíl'!$B$2:$C$252,2,FALSE))","v":"10:03:21"},{"$f":"IF(ISERROR(H342-G342),\"\",IF(H342=0,\"chybí čas\",H342-G342))","v":"00:03:21"},{"$f":"IF(D342=D341,J341+1,1)","v":2},{"$f":"VLOOKUP(C342,'Kategorie - UPRAV ROK!'!$A$18:$C$21,3,FALSE)","v":3}]
["Šajgalík Palo",1979,"hm",{"$f":"IF(B343=\"\",\"\",VLOOKUP('Kategorie - UPRAV ROK!'!$B$1-B343,'Kategorie - UPRAV ROK!'!$A$5:$G$13,OFFSET(B343,0,9)+3,TRUE))","v":"XI - HOROLEZCI VETERÁNI"},99,45,{"$f":"$N$14+F343/(60*24)","v":"10:45:00"},{"$f":"IF(ISERROR(VLOOKUP(E343,'Časy cíl'!$B$2:$C$252,2,FALSE)),\"\",VLOOKUP(E343,'Časy cíl'!$B$2:$C$252,2,FALSE))","v":"10:49:09"},{"$f":"IF(ISERROR(H343-G343),\"\",IF(H343=0,\"chybí čas\",H343-G343))","v":"00:04:09"},{"$f":"IF(D343=D342,J342+1,1)","v":3},{"$f":"VLOOKUP(C343,'Kategorie - UPRAV ROK!'!$A$18:$C$21,3,FALSE)","v":3}]
["Havelka Petr",1979,"hm",{"$f":"IF(B344=\"\",\"\",VLOOKUP('[1]Kategorie - UPRAV ROK!'!$B$1-B344,'[1]Kategorie - UPRAV ROK!'!$A$5:$G$13,OFFSET(B344,0,9)+3,TRUE))","v":"XI - HOROLEZCI VETERÁNI"},97,44,{"$f":"$N$14+F344/(60*24)","v":"10:44:00"},{"$f":"IF(ISERROR(VLOOKUP(E344,'Časy cíl'!$B$2:$C$252,2,FALSE)),\"\",VLOOKUP(E344,'Časy cíl'!$B$2:$C$252,2,FALSE))","v":"10:48:14"},{"$f":"IF(ISERROR(H344-G344),\"\",IF(H344=0,\"chybí čas\",H344-G344))","v":"00:04:14"},{"$f":"IF(D344=D343,J343+1,1)","v":4},{"$f":"VLOOKUP(C344,'Kategorie - UPRAV ROK!'!$A$18:$C$21,3,FALSE)","v":3}]
["Müller Václav",1981,"hm",{"$f":"IF(B345=\"\",\"\",VLOOKUP('Kategorie - UPRAV ROK!'!$B$1-B345,'Kategorie - UPRAV ROK!'!$A$5:$G$13,OFFSET(B345,0,9)+3,TRUE))","v":"XI - HOROLEZCI VETERÁNI"},98,44,{"$f":"$N$14+F345/(60*24)","v":"10:44:00"},{"$f":"IF(ISERROR(VLOOKUP(E345,'Časy cíl'!$B$2:$C$252,2,FALSE)),\"\",VLOOKUP(E345,'Časy cíl'!$B$2:$C$252,2,FALSE))","v":"10:49:34"},{"$f":"IF(ISERROR(H345-G345),\"\",IF(H345=0,\"chybí čas\",H345-G345))","v":"00:05:34"},{"$f":"IF(D345=D344,J344+1,1)","v":5},{"$f":"VLOOKUP(C345,'Kategorie - UPRAV ROK!'!$A$18:$C$21,3,FALSE)","v":3}]
["Schnabl Petr",1974,"hm",{"$f":"IF(B346=\"\",\"\",VLOOKUP('Kategorie - UPRAV ROK!'!$B$1-B346,'Kategorie - UPRAV ROK!'!$A$5:$G$13,OFFSET(B346,0,9)+3,TRUE))","v":"XI - HOROLEZCI VETERÁNI"},null,null,{"$f":"$N$14+F346/(60*24)","v":"10:00:00"},{"$f":"IF(ISERROR(VLOOKUP(E346,'Časy cíl'!$B$2:$C$252,2,FALSE)),\"\",VLOOKUP(E346,'Časy cíl'!$B$2:$C$252,2,FALSE))","v":""},{"$f":"IF(ISERROR(H346-G346),\"\",IF(H346=0,\"chybí čas\",H346-G346))","v":""},{"$f":"IF(D346=D345,J345+1,1)","v":6},{"$f":"VLOOKUP(C346,'Kategorie - UPRAV ROK!'!$A$18:$C$21,3,FALSE)","v":3}]
["Schnablová Renáta",1978,"hz",{"$f":"IF(B347=\"\",\"\",VLOOKUP('Kategorie - UPRAV ROK!'!$B$1-B347,'Kategorie - UPRAV ROK!'!$A$5:$G$13,OFFSET(B347,0,9)+3,TRUE))","v":"XI - HOROLEZKYNĚ VETERÁNKY"},null,null,{"$f":"$N$14+F347/(60*24)","v":"10:00:00"},{"$f":"IF(ISERROR(VLOOKUP(E347,'Časy cíl'!$B$2:$C$252,2,FALSE)),\"\",VLOOKUP(E347,'Časy cíl'!$B$2:$C$252,2,FALSE))","v":""},{"$f":"IF(ISERROR(H347-G347),\"\",IF(H347=0,\"chybí čas\",H347-G347))","v":""},{"$f":"IF(D347=D346,J346+1,1)","v":1},{"$f":"VLOOKUP(C347,'Kategorie - UPRAV ROK!'!$A$18:$C$21,3,FALSE)","v":4}]
[{"$nulls":3},{"$f":"IF(B348=\"\",\"\",VLOOKUP('Kategorie - UPRAV ROK!'!$B$1-B348,'Kategorie - UPRAV ROK!'!$A$5:$G$13,OFFSET(B348,0,9)+3,TRUE))","v":""},null,null,{"$f":"$N$14+F348/(60*24)","v":"10:00:00"},{"$f":"IF(ISERROR(VLOOKUP(E348,'Časy cíl'!$B$2:$C$252,2,FALSE)),\"\",VLOOKUP(E348,'Časy cíl'!$B$2:$C$252,2,FALSE))","v":""},{"$f":"IF(ISERROR(H348-G348),\"\",IF(H348=0,\"chybí čas\",H348-G348))","v":""},{"$f":"IF(D348=D347,J347+1,1)","v":1},{"$f":"VLOOKUP(C348,'Kategorie - UPRAV ROK!'!$A$18:$C$21,3,FALSE)","v":{"$error":"#N/A"}}]
[{"$nulls":3},{"$f":"IF(B349=\"\",\"\",VLOOKUP('Kategorie - UPRAV ROK!'!$B$1-B349,'Kategorie - UPRAV ROK!'!$A$5:$G$13,OFFSET(B349,0,9)+3,TRUE))","v":""},null,null,"10:00:00",{"$f":"IF(ISERROR(VLOOKUP(E349,'Časy cíl'!$B$2:$C$252,2,FALSE)),\"\",VLOOKUP(E349,'Časy cíl'!$B$2:$C$252,2,FALSE))","v":""},"",2,{"$f":"VLOOKUP(C349,'Kategorie - UPRAV ROK!'!$A$18:$C$21,3,FALSE)","v":{"$error":"#N/A"}}]
[{"$nulls":3},{"$f":"IF(B350=\"\",\"\",VLOOKUP('Kategorie - UPRAV ROK!'!$B$1-B350,'Kategorie - UPRAV ROK!'!$A$5:$G$13,OFFSET(B350,0,9)+3,TRUE))","v":""},null,null,"10:00:00",{"$f":"IF(ISERROR(VLOOKUP(E350,'Časy cíl'!$B$2:$C$252,2,FALSE)),\"\",VLOOKUP(E350,'Časy cíl'!$B$2:$C$252,2,FALSE))","v":""},"",3,{"$f":"VLOOKUP(C350,'Kategorie - UPRAV ROK!'!$A$18:$C$21,3,FALSE)","v":{"$error":"#N/A"}}]
[{"$nulls":3},{"$f":"IF(B351=\"\",\"\",VLOOKUP('Kategorie - UPRAV ROK!'!$B$1-B351,'Kategorie - UPRAV ROK!'!$A$5:$G$13,OFFSET(B351,0,9)+3,TRUE))","v":""},null,null,"10:00:00",{"$f":"IF(ISERROR(VLOOKUP(E351,'Časy cíl'!$B$2:$C$252,2,FALSE)),\"\",VLOOKUP(E351,'Časy cíl'!$B$2:$C$252,2,FALSE))","v":""},"",4,{"$f":"VLOOKUP(C351,'Kategorie - UPRAV ROK!'!$A$18:$C$21,3,FALSE)","v":{"$error":"#N/A"}}]
[{"$nulls":3},{"$f":"IF(B352=\"\",\"\",VLOOKUP('Kategorie - UPRAV ROK!'!$B$1-B352,'Kategorie - UPRAV ROK!'!$A$5:$G$13,OFFSET(B352,0,9)+3,TRUE))","v":""},null,null,"10:00:00",{"$f":"IF(ISERROR(VLOOKUP(E352,'Časy cíl'!$B$2:$C$252,2,FALSE)),\"\",VLOOKUP(E352,'Časy cíl'!$B$2:$C$252,2,FALSE))","v":""},"",5,{"$f":"VLOOKUP(C352,'Kategorie - UPRAV ROK!'!$A$18:$C$21,3,FALSE)","v":{"$error":"#N/A"}}]
[{"$nulls":3},{"$f":"IF(B353=\"\",\"\",VLOOKUP('Kategorie - UPRAV ROK!'!$B$1-B353,'Kategorie - UPRAV ROK!'!$A$5:$G$13,OFFSET(B353,0,9)+3,TRUE))","v":""},null,null,"10:00:00",{"$f":"IF(ISERROR(VLOOKUP(E353,'Časy cíl'!$B$2:$C$252,2,FALSE)),\"\",VLOOKUP(E353,'Časy cíl'!$B$2:$C$252,2,FALSE))","v":""},"",6,{"$f":"VLOOKUP(C353,'Kategorie - UPRAV ROK!'!$A$18:$C$21,3,FALSE)","v":{"$error":"#N/A"}}]
[{"$nulls":3},{"$f":"IF(B354=\"\",\"\",VLOOKUP('Kategorie - UPRAV ROK!'!$B$1-B354,'Kategorie - UPRAV ROK!'!$A$5:$G$13,OFFSET(B354,0,9)+3,TRUE))","v":""},null,null,"10:00:00",{"$f":"IF(ISERROR(VLOOKUP(E354,'Časy cíl'!$B$2:$C$252,2,FALSE)),\"\",VLOOKUP(E354,'Časy cíl'!$B$2:$C$252,2,FALSE))","v":""},"",7,{"$f":"VLOOKUP(C354,'Kategorie - UPRAV ROK!'!$A$18:$C$21,3,FALSE)","v":{"$error":"#N/A"}}]
[{"$nulls":3},{"$f":"IF(B355=\"\",\"\",VLOOKUP('Kategorie - UPRAV ROK!'!$B$1-B355,'Kategorie - UPRAV ROK!'!$A$5:$G$13,OFFSET(B355,0,9)+3,TRUE))","v":""},null,null,"10:00:00",{"$f":"IF(ISERROR(VLOOKUP(E355,'Časy cíl'!$B$2:$C$252,2,FALSE)),\"\",VLOOKUP(E355,'Časy cíl'!$B$2:$C$252,2,FALSE))","v":""},"",8,{"$f":"VLOOKUP(C355,'Kategorie - UPRAV ROK!'!$A$18:$C$21,3,FALSE)","v":{"$error":"#N/A"}}]
[{"$nulls":3},{"$f":"IF(B356=\"\",\"\",VLOOKUP('Kategorie - UPRAV ROK!'!$B$1-B356,'Kategorie - UPRAV ROK!'!$A$5:$G$13,OFFSET(B356,0,9)+3,TRUE))","v":""},null,null,"10:00:00",{"$f":"IF(ISERROR(VLOOKUP(E356,'Časy cíl'!$B$2:$C$252,2,FALSE)),\"\",VLOOKUP(E356,'Časy cíl'!$B$2:$C$252,2,FALSE))","v":""},"",9,{"$f":"VLOOKUP(C356,'Kategorie - UPRAV ROK!'!$A$18:$C$21,3,FALSE)","v":{"$error":"#N/A"}}]
[{"$nulls":3},{"$f":"IF(B357=\"\",\"\",VLOOKUP('Kategorie - UPRAV ROK!'!$B$1-B357,'Kategorie - UPRAV ROK!'!$A$5:$G$13,OFFSET(B357,0,9)+3,TRUE))","v":""},null,null,"10:00:00",{"$f":"IF(ISERROR(VLOOKUP(E357,'Časy cíl'!$B$2:$C$252,2,FALSE)),\"\",VLOOKUP(E357,'Časy cíl'!$B$2:$C$252,2,FALSE))","v":""},"",10,{"$f":"VLOOKUP(C357,'Kategorie - UPRAV ROK!'!$A$18:$C$21,3,FALSE)","v":{"$error":"#N/A"}}]
[{"$nulls":3},{"$f":"IF(B358=\"\",\"\",VLOOKUP('Kategorie - UPRAV ROK!'!$B$1-B358,'Kategorie - UPRAV ROK!'!$A$5:$G$13,OFFSET(B358,0,9)+3,TRUE))","v":""},null,null,"10:00:00",{"$f":"IF(ISERROR(VLOOKUP(E358,'Časy cíl'!$B$2:$C$252,2,FALSE)),\"\",VLOOKUP(E358,'Časy cíl'!$B$2:$C$252,2,FALSE))","v":""},"",11,{"$f":"VLOOKUP(C358,'Kategorie - UPRAV ROK!'!$A$18:$C$21,3,FALSE)","v":{"$error":"#N/A"}}]
[{"$nulls":3},{"$f":"IF(B359=\"\",\"\",VLOOKUP('Kategorie - UPRAV ROK!'!$B$1-B359,'Kategorie - UPRAV ROK!'!$A$5:$G$13,OFFSET(B359,0,9)+3,TRUE))","v":""},null,null,{"$f":"$N$14+F359/(60*24)","v":"10:00:00"},{"$f":"IF(ISERROR(VLOOKUP(E359,'Časy cíl'!$B$2:$C$252,2,FALSE)),\"\",VLOOKUP(E359,'Časy cíl'!$B$2:$C$252,2,FALSE))","v":""},"",12,{"$f":"VLOOKUP(C359,'Kategorie - UPRAV ROK!'!$A$18:$C$21,3,FALSE)","v":{"$error":"#N/A"}}]
[{"$nulls":3},{"$f":"IF(B360=\"\",\"\",VLOOKUP('Kategorie - UPRAV ROK!'!$B$1-B360,'Kategorie - UPRAV ROK!'!$A$5:$G$13,OFFSET(B360,0,9)+3,TRUE))","v":""},null,null,"10:00:00",{"$f":"IF(ISERROR(VLOOKUP(E360,'Časy cíl'!$B$2:$C$252,2,FALSE)),\"\",VLOOKUP(E360,'Časy cíl'!$B$2:$C$252,2,FALSE))","v":""},"",13,{"$f":"VLOOKUP(C360,'Kategorie - UPRAV ROK!'!$A$18:$C$21,3,FALSE)","v":{"$error":"#N/A"}}]
[{"$nulls":3},{"$f":"IF(B361=\"\",\"\",VLOOKUP('Kategorie - UPRAV ROK!'!$B$1-B361,'Kategorie - UPRAV ROK!'!$A$5:$G$13,OFFSET(B361,0,9)+3,TRUE))","v":""},null,null,"10:00:00",{"$f":"IF(ISERROR(VLOOKUP(E361,'Časy cíl'!$B$2:$C$252,2,FALSE)),\"\",VLOOKUP(E361,'Časy cíl'!$B$2:$C$252,2,FALSE))","v":""},"",14,{"$f":"VLOOKUP(C361,'Kategorie - UPRAV ROK!'!$A$18:$C$21,3,FALSE)","v":{"$error":"#N/A"}}]
[{"$nulls":3},{"$f":"IF(B362=\"\",\"\",VLOOKUP('Kategorie - UPRAV ROK!'!$B$1-B362,'Kategorie - UPRAV ROK!'!$A$5:$G$13,OFFSET(B362,0,9)+3,TRUE))","v":""},null,null,"10:00:00",{"$f":"IF(ISERROR(VLOOKUP(E362,'Časy cíl'!$B$2:$C$252,2,FALSE)),\"\",VLOOKUP(E362,'Časy cíl'!$B$2:$C$252,2,FALSE))","v":""},"",15,{"$f":"VLOOKUP(C362,'Kategorie - UPRAV ROK!'!$A$18:$C$21,3,FALSE)","v":{"$error":"#N/A"}}]
[{"$nulls":3},{"$f":"IF(B363=\"\",\"\",VLOOKUP('Kategorie - UPRAV ROK!'!$B$1-B363,'Kategorie - UPRAV ROK!'!$A$5:$G$13,OFFSET(B363,0,9)+3,TRUE))","v":""},null,null,"10:00:00",{"$f":"IF(ISERROR(VLOOKUP(E363,'Časy cíl'!$B$2:$C$252,2,FALSE)),\"\",VLOOKUP(E363,'Časy cíl'!$B$2:$C$252,2,FALSE))","v":""},"",16,{"$f":"VLOOKUP(C363,'Kategorie - UPRAV ROK!'!$A$18:$C$21,3,FALSE)","v":{"$error":"#N/A"}}]
[{"$nulls":3},{"$f":"IF(B364=\"\",\"\",VLOOKUP('Kategorie - UPRAV ROK!'!$B$1-B364,'Kategorie - UPRAV ROK!'!$A$5:$G$13,OFFSET(B364,0,9)+3,TRUE))","v":""},null,null,"10:00:00",{"$f":"IF(ISERROR(VLOOKUP(E364,'Časy cíl'!$B$2:$C$252,2,FALSE)),\"\",VLOOKUP(E364,'Časy cíl'!$B$2:$C$252,2,FALSE))","v":""},"",17,{"$f":"VLOOKUP(C364,'Kategorie - UPRAV ROK!'!$A$18:$C$21,3,FALSE)","v":{"$error":"#N/A"}}]
[{"$nulls":3},{"$f":"IF(B365=\"\",\"\",VLOOKUP('Kategorie - UPRAV ROK!'!$B$1-B365,'Kategorie - UPRAV ROK!'!$A$5:$G$13,OFFSET(B365,0,9)+3,TRUE))","v":""},null,null,"10:00:00",{"$f":"IF(ISERROR(VLOOKUP(E365,'Časy cíl'!$B$2:$C$252,2,FALSE)),\"\",VLOOKUP(E365,'Časy cíl'!$B$2:$C$252,2,FALSE))","v":""},"",18,{"$f":"VLOOKUP(C365,'Kategorie - UPRAV ROK!'!$A$18:$C$21,3,FALSE)","v":{"$error":"#N/A"}}]
[{"$nulls":3},{"$f":"IF(B366=\"\",\"\",VLOOKUP('Kategorie - UPRAV ROK!'!$B$1-B366,'Kategorie - UPRAV ROK!'!$A$5:$G$13,OFFSET(B366,0,9)+3,TRUE))","v":""},null,null,"10:00:00",{"$f":"IF(ISERROR(VLOOKUP(E366,'Časy cíl'!$B$2:$C$252,2,FALSE)),\"\",VLOOKUP(E366,'Časy cíl'!$B$2:$C$252,2,FALSE))","v":""},"",19,{"$f":"VLOOKUP(C366,'Kategorie - UPRAV ROK!'!$A$18:$C$21,3,FALSE)","v":{"$error":"#N/A"}}]
[{"$nulls":3},{"$f":"IF(B367=\"\",\"\",VLOOKUP('Kategorie - UPRAV ROK!'!$B$1-B367,'Kategorie - UPRAV ROK!'!$A$5:$G$13,OFFSET(B367,0,9)+3,TRUE))","v":""},null,null,"10:00:00",{"$f":"IF(ISERROR(VLOOKUP(E367,'Časy cíl'!$B$2:$C$252,2,FALSE)),\"\",VLOOKUP(E367,'Časy cíl'!$B$2:$C$252,2,FALSE))","v":""},"",20,{"$f":"VLOOKUP(C367,'Kategorie - UPRAV ROK!'!$A$18:$C$21,3,FALSE)","v":{"$error":"#N/A"}}]
[{"$nulls":3},{"$f":"IF(B368=\"\",\"\",VLOOKUP('Kategorie - UPRAV ROK!'!$B$1-B368,'Kategorie - UPRAV ROK!'!$A$5:$G$13,OFFSET(B368,0,9)+3,TRUE))","v":""},null,null,"10:00:00",{"$f":"IF(ISERROR(VLOOKUP(E368,'Časy cíl'!$B$2:$C$252,2,FALSE)),\"\",VLOOKUP(E368,'Časy cíl'!$B$2:$C$252,2,FALSE))","v":""},"",21,{"$f":"VLOOKUP(C368,'Kategorie - UPRAV ROK!'!$A$18:$C$21,3,FALSE)","v":{"$error":"#N/A"}}]
[{"$nulls":3},{"$f":"IF(B369=\"\",\"\",VLOOKUP('Kategorie - UPRAV ROK!'!$B$1-B369,'Kategorie - UPRAV ROK!'!$A$5:$G$13,OFFSET(B369,0,9)+3,TRUE))","v":""},null,null,"10:00:00",{"$f":"IF(ISERROR(VLOOKUP(E369,'Časy cíl'!$B$2:$C$252,2,FALSE)),\"\",VLOOKUP(E369,'Časy cíl'!$B$2:$C$252,2,FALSE))","v":""},"",22,{"$f":"VLOOKUP(C369,'Kategorie - UPRAV ROK!'!$A$18:$C$21,3,FALSE)","v":{"$error":"#N/A"}}]
[{"$nulls":3},{"$f":"IF(B370=\"\",\"\",VLOOKUP('Kategorie - UPRAV ROK!'!$B$1-B370,'Kategorie - UPRAV ROK!'!$A$5:$G$13,OFFSET(B370,0,9)+3,TRUE))","v":""},null,null,"10:00:00",{"$f":"IF(ISERROR(VLOOKUP(E370,'Časy cíl'!$B$2:$C$252,2,FALSE)),\"\",VLOOKUP(E370,'Časy cíl'!$B$2:$C$252,2,FALSE))","v":""},"",23,{"$f":"VLOOKUP(C370,'Kategorie - UPRAV ROK!'!$A$18:$C$21,3,FALSE)","v":{"$error":"#N/A"}}]
[{"$nulls":3},{"$f":"IF(B371=\"\",\"\",VLOOKUP('Kategorie - UPRAV ROK!'!$B$1-B371,'Kategorie - UPRAV ROK!'!$A$5:$G$13,OFFSET(B371,0,9)+3,TRUE))","v":""},null,null,"10:00:00",{"$f":"IF(ISERROR(VLOOKUP(E371,'Časy cíl'!$B$2:$C$252,2,FALSE)),\"\",VLOOKUP(E371,'Časy cíl'!$B$2:$C$252,2,FALSE))","v":""},"",24,{"$f":"VLOOKUP(C371,'Kategorie - UPRAV ROK!'!$A$18:$C$21,3,FALSE)","v":{"$error":"#N/A"}}]
[{"$nulls":3},{"$f":"IF(B372=\"\",\"\",VLOOKUP('Kategorie - UPRAV ROK!'!$B$1-B372,'Kategorie - UPRAV ROK!'!$A$5:$G$13,OFFSET(B372,0,9)+3,TRUE))","v":""},null,null,"10:00:00",{"$f":"IF(ISERROR(VLOOKUP(E372,'Časy cíl'!$B$2:$C$252,2,FALSE)),\"\",VLOOKUP(E372,'Časy cíl'!$B$2:$C$252,2,FALSE))","v":""},"",25,{"$f":"VLOOKUP(C372,'Kategorie - UPRAV ROK!'!$A$18:$C$21,3,FALSE)","v":{"$error":"#N/A"}}]
[{"$nulls":3},{"$f":"IF(B373=\"\",\"\",VLOOKUP('Kategorie - UPRAV ROK!'!$B$1-B373,'Kategorie - UPRAV ROK!'!$A$5:$G$13,OFFSET(B373,0,9)+3,TRUE))","v":""},null,null,"10:00:00",{"$f":"IF(ISERROR(VLOOKUP(E373,'Časy cíl'!$B$2:$C$252,2,FALSE)),\"\",VLOOKUP(E373,'Časy cíl'!$B$2:$C$252,2,FALSE))","v":""},"",26,{"$f":"VLOOKUP(C373,'Kategorie - UPRAV ROK!'!$A$18:$C$21,3,FALSE)","v":{"$error":"#N/A"}}]
[{"$nulls":3},{"$f":"IF(B374=\"\",\"\",VLOOKUP('Kategorie - UPRAV ROK!'!$B$1-B374,'Kategorie - UPRAV ROK!'!$A$5:$G$13,OFFSET(B374,0,9)+3,TRUE))","v":""},null,null,"10:00:00",{"$f":"IF(ISERROR(VLOOKUP(E374,'Časy cíl'!$B$2:$C$252,2,FALSE)),\"\",VLOOKUP(E374,'Časy cíl'!$B$2:$C$252,2,FALSE))","v":""},"",27,{"$f":"VLOOKUP(C374,'Kategorie - UPRAV ROK!'!$A$18:$C$21,3,FALSE)","v":{"$error":"#N/A"}}]
[{"$nulls":3},{"$f":"IF(B375=\"\",\"\",VLOOKUP('Kategorie - UPRAV ROK!'!$B$1-B375,'Kategorie - UPRAV ROK!'!$A$5:$G$13,OFFSET(B375,0,9)+3,TRUE))","v":""},null,null,"10:00:00",{"$f":"IF(ISERROR(VLOOKUP(E375,'Časy cíl'!$B$2:$C$252,2,FALSE)),\"\",VLOOKUP(E375,'Časy cíl'!$B$2:$C$252,2,FALSE))","v":""},"",28,{"$f":"VLOOKUP(C375,'Kategorie - UPRAV ROK!'!$A$18:$C$21,3,FALSE)","v":{"$error":"#N/A"}}]
[{"$nulls":3},{"$f":"IF(B376=\"\",\"\",VLOOKUP('Kategorie - UPRAV ROK!'!$B$1-B376,'Kategorie - UPRAV ROK!'!$A$5:$G$13,OFFSET(B376,0,9)+3,TRUE))","v":""},null,null,"10:00:00",{"$f":"IF(ISERROR(VLOOKUP(E376,'Časy cíl'!$B$2:$C$252,2,FALSE)),\"\",VLOOKUP(E376,'Časy cíl'!$B$2:$C$252,2,FALSE))","v":""},"",29,{"$f":"VLOOKUP(C376,'Kategorie - UPRAV ROK!'!$A$18:$C$21,3,FALSE)","v":{"$error":"#N/A"}}]
[{"$nulls":3},{"$f":"IF(B377=\"\",\"\",VLOOKUP('Kategorie - UPRAV ROK!'!$B$1-B377,'Kategorie - UPRAV ROK!'!$A$5:$G$13,OFFSET(B377,0,9)+3,TRUE))","v":""},null,null,"10:00:00",{"$f":"IF(ISERROR(VLOOKUP(E377,'Časy cíl'!$B$2:$C$252,2,FALSE)),\"\",VLOOKUP(E377,'Časy cíl'!$B$2:$C$252,2,FALSE))","v":""},"",30,{"$f":"VLOOKUP(C377,'Kategorie - UPRAV ROK!'!$A$18:$C$21,3,FALSE)","v":{"$error":"#N/A"}}]
[{"$nulls":3},{"$f":"IF(B378=\"\",\"\",VLOOKUP('Kategorie - UPRAV ROK!'!$B$1-B378,'Kategorie - UPRAV ROK!'!$A$5:$G$13,OFFSET(B378,0,9)+3,TRUE))","v":""},null,null,"10:00:00",{"$f":"IF(ISERROR(VLOOKUP(E378,'Časy cíl'!$B$2:$C$252,2,FALSE)),\"\",VLOOKUP(E378,'Časy cíl'!$B$2:$C$252,2,FALSE))","v":""},"",31,{"$f":"VLOOKUP(C378,'Kategorie - UPRAV ROK!'!$A$18:$C$21,3,FALSE)","v":{"$error":"#N/A"}}]
[{"$nulls":3},{"$f":"IF(B379=\"\",\"\",VLOOKUP('Kategorie - UPRAV ROK!'!$B$1-B379,'Kategorie - UPRAV ROK!'!$A$5:$G$13,OFFSET(B379,0,9)+3,TRUE))","v":""},null,null,"10:00:00",{"$f":"IF(ISERROR(VLOOKUP(E379,'Časy cíl'!$B$2:$C$252,2,FALSE)),\"\",VLOOKUP(E379,'Časy cíl'!$B$2:$C$252,2,FALSE))","v":""},"",32,{"$f":"VLOOKUP(C379,'Kategorie - UPRAV ROK!'!$A$18:$C$21,3,FALSE)","v":{"$error":"#N/A"}}]
[{"$nulls":3},{"$f":"IF(B380=\"\",\"\",VLOOKUP('Kategorie - UPRAV ROK!'!$B$1-B380,'Kategorie - UPRAV ROK!'!$A$5:$G$13,OFFSET(B380,0,9)+3,TRUE))","v":""},null,null,"10:00:00",{"$f":"IF(ISERROR(VLOOKUP(E380,'Časy cíl'!$B$2:$C$252,2,FALSE)),\"\",VLOOKUP(E380,'Časy cíl'!$B$2:$C$252,2,FALSE))","v":""},"",33,{"$f":"VLOOKUP(C380,'Kategorie - UPRAV ROK!'!$A$18:$C$21,3,FALSE)","v":{"$error":"#N/A"}}]
[{"$nulls":3},{"$f":"IF(B381=\"\",\"\",VLOOKUP('Kategorie - UPRAV ROK!'!$B$1-B381,'Kategorie - UPRAV ROK!'!$A$5:$G$13,OFFSET(B381,0,9)+3,TRUE))","v":""},null,null,"10:00:00",{"$f":"IF(ISERROR(VLOOKUP(E381,'Časy cíl'!$B$2:$C$252,2,FALSE)),\"\",VLOOKUP(E381,'Časy cíl'!$B$2:$C$252,2,FALSE))","v":""},"",34,{"$f":"VLOOKUP(C381,'Kategorie - UPRAV ROK!'!$A$18:$C$21,3,FALSE)","v":{"$error":"#N/A"}}]
[{"$nulls":3},{"$f":"IF(B382=\"\",\"\",VLOOKUP('Kategorie - UPRAV ROK!'!$B$1-B382,'Kategorie - UPRAV ROK!'!$A$5:$G$13,OFFSET(B382,0,9)+3,TRUE))","v":""},null,null,"10:00:00",{"$f":"IF(ISERROR(VLOOKUP(E382,'Časy cíl'!$B$2:$C$252,2,FALSE)),\"\",VLOOKUP(E382,'Časy cíl'!$B$2:$C$252,2,FALSE))","v":""},"",35,{"$f":"VLOOKUP(C382,'Kategorie - UPRAV ROK!'!$A$18:$C$21,3,FALSE)","v":{"$error":"#N/A"}}]
[{"$nulls":3},{"$f":"IF(B383=\"\",\"\",VLOOKUP('Kategorie - UPRAV ROK!'!$B$1-B383,'Kategorie - UPRAV ROK!'!$A$5:$G$13,OFFSET(B383,0,9)+3,TRUE))","v":""},null,null,"10:00:00",{"$f":"IF(ISERROR(VLOOKUP(E383,'Časy cíl'!$B$2:$C$252,2,FALSE)),\"\",VLOOKUP(E383,'Časy cíl'!$B$2:$C$252,2,FALSE))","v":""},"",36,{"$f":"VLOOKUP(C383,'Kategorie - UPRAV ROK!'!$A$18:$C$21,3,FALSE)","v":{"$error":"#N/A"}}]
[{"$nulls":3},{"$f":"IF(B384=\"\",\"\",VLOOKUP('Kategorie - UPRAV ROK!'!$B$1-B384,'Kategorie - UPRAV ROK!'!$A$5:$G$13,OFFSET(B384,0,9)+3,TRUE))","v":""},null,null,"10:00:00",{"$f":"IF(ISERROR(VLOOKUP(E384,'Časy cíl'!$B$2:$C$252,2,FALSE)),\"\",VLOOKUP(E384,'Časy cíl'!$B$2:$C$252,2,FALSE))","v":""},"",37,{"$f":"VLOOKUP(C384,'Kategorie - UPRAV ROK!'!$A$18:$C$21,3,FALSE)","v":{"$error":"#N/A"}}]
[{"$nulls":3},{"$f":"IF(B385=\"\",\"\",VLOOKUP('Kategorie - UPRAV ROK!'!$B$1-B385,'Kategorie - UPRAV ROK!'!$A$5:$G$13,OFFSET(B385,0,9)+3,TRUE))","v":""},null,null,"10:00:00",{"$f":"IF(ISERROR(VLOOKUP(E385,'Časy cíl'!$B$2:$C$252,2,FALSE)),\"\",VLOOKUP(E385,'Časy cíl'!$B$2:$C$252,2,FALSE))","v":""},"",38,{"$f":"VLOOKUP(C385,'Kategorie - UPRAV ROK!'!$A$18:$C$21,3,FALSE)","v":{"$error":"#N/A"}}]
[{"$nulls":3},{"$f":"IF(B386=\"\",\"\",VLOOKUP('Kategorie - UPRAV ROK!'!$B$1-B386,'Kategorie - UPRAV ROK!'!$A$5:$G$13,OFFSET(B386,0,9)+3,TRUE))","v":""},null,null,"10:00:00",{"$f":"IF(ISERROR(VLOOKUP(E386,'Časy cíl'!$B$2:$C$252,2,FALSE)),\"\",VLOOKUP(E386,'Časy cíl'!$B$2:$C$252,2,FALSE))","v":""},"",39,{"$f":"VLOOKUP(C386,'Kategorie - UPRAV ROK!'!$A$18:$C$21,3,FALSE)","v":{"$error":"#N/A"}}]
[{"$nulls":3},{"$f":"IF(B387=\"\",\"\",VLOOKUP('Kategorie - UPRAV ROK!'!$B$1-B387,'Kategorie - UPRAV ROK!'!$A$5:$G$13,OFFSET(B387,0,9)+3,TRUE))","v":""},null,null,"10:00:00",{"$f":"IF(ISERROR(VLOOKUP(E387,'Časy cíl'!$B$2:$C$252,2,FALSE)),\"\",VLOOKUP(E387,'Časy cíl'!$B$2:$C$252,2,FALSE))","v":""},{"$f":"IF(ISERROR(H387-G387),\"\",IF(H387=0,\"chybí čas\",H387-G387))","v":""},{"$f":"IF(D387=D386,J386+1,1)","v":40},{"$f":"VLOOKUP(C387,'Kategorie - UPRAV ROK!'!$A$18:$C$21,3,FALSE)","v":{"$error":"#N/A"}}]
[{"$nulls":3},{"$f":"IF(B388=\"\",\"\",VLOOKUP('Kategorie - UPRAV ROK!'!$B$1-B388,'Kategorie - UPRAV ROK!'!$A$5:$G$13,OFFSET(B388,0,9)+3,TRUE))","v":""},null,null,"10:00:00",{"$f":"IF(ISERROR(VLOOKUP(E388,'Časy cíl'!$B$2:$C$252,2,FALSE)),\"\",VLOOKUP(E388,'Časy cíl'!$B$2:$C$252,2,FALSE))","v":""},"",41,{"$f":"VLOOKUP(C388,'Kategorie - UPRAV ROK!'!$A$18:$C$21,3,FALSE)","v":{"$error":"#N/A"}}]
[{"$nulls":3},{"$f":"IF(B389=\"\",\"\",VLOOKUP('Kategorie - UPRAV ROK!'!$B$1-B389,'Kategorie - UPRAV ROK!'!$A$5:$G$13,OFFSET(B389,0,9)+3,TRUE))","v":""},null,null,"10:00:00",{"$f":"IF(ISERROR(VLOOKUP(E389,'Časy cíl'!$B$2:$C$252,2,FALSE)),\"\",VLOOKUP(E389,'Časy cíl'!$B$2:$C$252,2,FALSE))","v":""},"",42,{"$f":"VLOOKUP(C389,'Kategorie - UPRAV ROK!'!$A$18:$C$21,3,FALSE)","v":{"$error":"#N/A"}}]
[{"$nulls":3},{"$f":"IF(B390=\"\",\"\",VLOOKUP('Kategorie - UPRAV ROK!'!$B$1-B390,'Kategorie - UPRAV ROK!'!$A$5:$G$13,OFFSET(B390,0,9)+3,TRUE))","v":""},null,null,"10:00:00",{"$f":"IF(ISERROR(VLOOKUP(E390,'Časy cíl'!$B$2:$C$252,2,FALSE)),\"\",VLOOKUP(E390,'Časy cíl'!$B$2:$C$252,2,FALSE))","v":""},"",43,{"$f":"VLOOKUP(C390,'Kategorie - UPRAV ROK!'!$A$18:$C$21,3,FALSE)","v":{"$error":"#N/A"}}]
[{"$nulls":3},{"$f":"IF(B391=\"\",\"\",VLOOKUP('Kategorie - UPRAV ROK!'!$B$1-B391,'Kategorie - UPRAV ROK!'!$A$5:$G$13,OFFSET(B391,0,9)+3,TRUE))","v":""},null,null,"10:00:00",{"$f":"IF(ISERROR(VLOOKUP(E391,'Časy cíl'!$B$2:$C$252,2,FALSE)),\"\",VLOOKUP(E391,'Časy cíl'!$B$2:$C$252,2,FALSE))","v":""},"",44,{"$f":"VLOOKUP(C391,'Kategorie - UPRAV ROK!'!$A$18:$C$21,3,FALSE)","v":{"$error":"#N/A"}}]
[{"$nulls":3},{"$f":"IF(B392=\"\",\"\",VLOOKUP('Kategorie - UPRAV ROK!'!$B$1-B392,'Kategorie - UPRAV ROK!'!$A$5:$G$13,OFFSET(B392,0,9)+3,TRUE))","v":""},null,null,"10:00:00",{"$f":"IF(ISERROR(VLOOKUP(E392,'Časy cíl'!$B$2:$C$252,2,FALSE)),\"\",VLOOKUP(E392,'Časy cíl'!$B$2:$C$252,2,FALSE))","v":""},"",45,{"$f":"VLOOKUP(C392,'Kategorie - UPRAV ROK!'!$A$18:$C$21,3,FALSE)","v":{"$error":"#N/A"}}]
[{"$nulls":3},{"$f":"IF(B393=\"\",\"\",VLOOKUP('Kategorie - UPRAV ROK!'!$B$1-B393,'Kategorie - UPRAV ROK!'!$A$5:$G$13,OFFSET(B393,0,9)+3,TRUE))","v":""},null,null,"10:00:00",{"$f":"IF(ISERROR(VLOOKUP(E393,'Časy cíl'!$B$2:$C$252,2,FALSE)),\"\",VLOOKUP(E393,'Časy cíl'!$B$2:$C$252,2,FALSE))","v":""},"",46,{"$f":"VLOOKUP(C393,'Kategorie - UPRAV ROK!'!$A$18:$C$21,3,FALSE)","v":{"$error":"#N/A"}}]
[{"$nulls":3},{"$f":"IF(B394=\"\",\"\",VLOOKUP('Kategorie - UPRAV ROK!'!$B$1-B394,'Kategorie - UPRAV ROK!'!$A$5:$G$13,OFFSET(B394,0,9)+3,TRUE))","v":""},null,null,"10:00:00",{"$f":"IF(ISERROR(VLOOKUP(E394,'Časy cíl'!$B$2:$C$252,2,FALSE)),\"\",VLOOKUP(E394,'Časy cíl'!$B$2:$C$252,2,FALSE))","v":""},"",47,{"$f":"VLOOKUP(C394,'Kategorie - UPRAV ROK!'!$A$18:$C$21,3,FALSE)","v":{"$error":"#N/A"}}]
[{"$nulls":3},{"$f":"IF(B395=\"\",\"\",VLOOKUP('Kategorie - UPRAV ROK!'!$B$1-B395,'Kategorie - UPRAV ROK!'!$A$5:$G$13,OFFSET(B395,0,9)+3,TRUE))","v":""},null,null,"10:00:00",{"$f":"IF(ISERROR(VLOOKUP(E395,'Časy cíl'!$B$2:$C$252,2,FALSE)),\"\",VLOOKUP(E395,'Časy cíl'!$B$2:$C$252,2,FALSE))","v":""},"",48,{"$f":"VLOOKUP(C395,'Kategorie - UPRAV ROK!'!$A$18:$C$21,3,FALSE)","v":{"$error":"#N/A"}}]
[{"$nulls":3},{"$f":"IF(B396=\"\",\"\",VLOOKUP('Kategorie - UPRAV ROK!'!$B$1-B396,'Kategorie - UPRAV ROK!'!$A$5:$G$13,OFFSET(B396,0,9)+3,TRUE))","v":""},null,null,"10:00:00",{"$f":"IF(ISERROR(VLOOKUP(E396,'Časy cíl'!$B$2:$C$252,2,FALSE)),\"\",VLOOKUP(E396,'Časy cíl'!$B$2:$C$252,2,FALSE))","v":""},"",49,{"$f":"VLOOKUP(C396,'Kategorie - UPRAV ROK!'!$A$18:$C$21,3,FALSE)","v":{"$error":"#N/A"}}]
[{"$nulls":3},{"$f":"IF(B397=\"\",\"\",VLOOKUP('Kategorie - UPRAV ROK!'!$B$1-B397,'Kategorie - UPRAV ROK!'!$A$5:$G$13,OFFSET(B397,0,9)+3,TRUE))","v":""},null,null,"10:00:00",{"$f":"IF(ISERROR(VLOOKUP(E397,'Časy cíl'!$B$2:$C$252,2,FALSE)),\"\",VLOOKUP(E397,'Časy cíl'!$B$2:$C$252,2,FALSE))","v":""},"",50,{"$f":"VLOOKUP(C397,'Kategorie - UPRAV ROK!'!$A$18:$C$21,3,FALSE)","v":{"$error":"#N/A"}}]
[{"$nulls":3},{"$f":"IF(B398=\"\",\"\",VLOOKUP('Kategorie - UPRAV ROK!'!$B$1-B398,'Kategorie - UPRAV ROK!'!$A$5:$G$13,OFFSET(B398,0,9)+3,TRUE))","v":""},null,null,"10:00:00",{"$f":"IF(ISERROR(VLOOKUP(E398,'Časy cíl'!$B$2:$C$252,2,FALSE)),\"\",VLOOKUP(E398,'Časy cíl'!$B$2:$C$252,2,FALSE))","v":""},"",51,{"$f":"VLOOKUP(C398,'Kategorie - UPRAV ROK!'!$A$18:$C$21,3,FALSE)","v":{"$error":"#N/A"}}]
[{"$nulls":3},{"$f":"IF(B399=\"\",\"\",VLOOKUP('Kategorie - UPRAV ROK!'!$B$1-B399,'Kategorie - UPRAV ROK!'!$A$5:$G$13,OFFSET(B399,0,9)+3,TRUE))","v":""},null,null,"10:00:00",{"$f":"IF(ISERROR(VLOOKUP(E399,'Časy cíl'!$B$2:$C$252,2,FALSE)),\"\",VLOOKUP(E399,'Časy cíl'!$B$2:$C$252,2,FALSE))","v":""},"",52,{"$f":"VLOOKUP(C399,'Kategorie - UPRAV ROK!'!$A$18:$C$21,3,FALSE)","v":{"$error":"#N/A"}}]
[{"$nulls":3},{"$f":"IF(B400=\"\",\"\",VLOOKUP('Kategorie - UPRAV ROK!'!$B$1-B400,'Kategorie - UPRAV ROK!'!$A$5:$G$13,OFFSET(B400,0,9)+3,TRUE))","v":""},null,null,"10:00:00",{"$f":"IF(ISERROR(VLOOKUP(E400,'Časy cíl'!$B$2:$C$252,2,FALSE)),\"\",VLOOKUP(E400,'Časy cíl'!$B$2:$C$252,2,FALSE))","v":""},"",53,{"$f":"VLOOKUP(C400,'Kategorie - UPRAV ROK!'!$A$18:$C$21,3,FALSE)","v":{"$error":"#N/A"}}]
[{"$nulls":3},{"$f":"IF(B401=\"\",\"\",VLOOKUP('Kategorie - UPRAV ROK!'!$B$1-B401,'Kategorie - UPRAV ROK!'!$A$5:$G$13,OFFSET(B401,0,9)+3,TRUE))","v":""},null,null,"10:00:00",{"$f":"IF(ISERROR(VLOOKUP(E401,'Časy cíl'!$B$2:$C$252,2,FALSE)),\"\",VLOOKUP(E401,'Časy cíl'!$B$2:$C$252,2,FALSE))","v":""},"",54,{"$f":"VLOOKUP(C401,'Kategorie - UPRAV ROK!'!$A$18:$C$21,3,FALSE)","v":{"$error":"#N/A"}}]
[{"$nulls":3},{"$f":"IF(B402=\"\",\"\",VLOOKUP('Kategorie - UPRAV ROK!'!$B$1-B402,'Kategorie - UPRAV ROK!'!$A$5:$G$13,OFFSET(B402,0,9)+3,TRUE))","v":""},null,null,"10:00:00",{"$f":"IF(ISERROR(VLOOKUP(E402,'Časy cíl'!$B$2:$C$252,2,FALSE)),\"\",VLOOKUP(E402,'Časy cíl'!$B$2:$C$252,2,FALSE))","v":""},"",55,{"$f":"VLOOKUP(C402,'Kategorie - UPRAV ROK!'!$A$18:$C$21,3,FALSE)","v":{"$error":"#N/A"}}]
[{"$nulls":3},{"$f":"IF(B403=\"\",\"\",VLOOKUP('Kategorie - UPRAV ROK!'!$B$1-B403,'Kategorie - UPRAV ROK!'!$A$5:$G$13,OFFSET(B403,0,9)+3,TRUE))","v":""},null,null,"10:00:00",{"$f":"IF(ISERROR(VLOOKUP(E403,'Časy cíl'!$B$2:$C$252,2,FALSE)),\"\",VLOOKUP(E403,'Časy cíl'!$B$2:$C$252,2,FALSE))","v":""},"",56,{"$f":"VLOOKUP(C403,'Kategorie - UPRAV ROK!'!$A$18:$C$21,3,FALSE)","v":{"$error":"#N/A"}}]
[{"$nulls":3},{"$f":"IF(B404=\"\",\"\",VLOOKUP('Kategorie - UPRAV ROK!'!$B$1-B404,'Kategorie - UPRAV ROK!'!$A$5:$G$13,OFFSET(B404,0,9)+3,TRUE))","v":""},null,null,"10:00:00",{"$f":"IF(ISERROR(VLOOKUP(E404,'Časy cíl'!$B$2:$C$252,2,FALSE)),\"\",VLOOKUP(E404,'Časy cíl'!$B$2:$C$252,2,FALSE))","v":""},"",57,{"$f":"VLOOKUP(C404,'Kategorie - UPRAV ROK!'!$A$18:$C$21,3,FALSE)","v":{"$error":"#N/A"}}]
[{"$nulls":3},{"$f":"IF(B405=\"\",\"\",VLOOKUP('Kategorie - UPRAV ROK!'!$B$1-B405,'Kategorie - UPRAV ROK!'!$A$5:$G$13,OFFSET(B405,0,9)+3,TRUE))","v":""},null,null,"10:00:00",{"$f":"IF(ISERROR(VLOOKUP(E405,'Časy cíl'!$B$2:$C$252,2,FALSE)),\"\",VLOOKUP(E405,'Časy cíl'!$B$2:$C$252,2,FALSE))","v":""},"",58,{"$f":"VLOOKUP(C405,'Kategorie - UPRAV ROK!'!$A$18:$C$21,3,FALSE)","v":{"$error":"#N/A"}}]
[{"$nulls":3},{"$f":"IF(B406=\"\",\"\",VLOOKUP('Kategorie - UPRAV ROK!'!$B$1-B406,'Kategorie - UPRAV ROK!'!$A$5:$G$13,OFFSET(B406,0,9)+3,TRUE))","v":""},null,null,"10:00:00",{"$f":"IF(ISERROR(VLOOKUP(E406,'Časy cíl'!$B$2:$C$252,2,FALSE)),\"\",VLOOKUP(E406,'Časy cíl'!$B$2:$C$252,2,FALSE))","v":""},"",59,{"$f":"VLOOKUP(C406,'Kategorie - UPRAV ROK!'!$A$18:$C$21,3,FALSE)","v":{"$error":"#N/A"}}]
[{"$nulls":3},{"$f":"IF(B407=\"\",\"\",VLOOKUP('Kategorie - UPRAV ROK!'!$B$1-B407,'Kategorie - UPRAV ROK!'!$A$5:$G$13,OFFSET(B407,0,9)+3,TRUE))","v":""},null,null,"10:00:00",{"$f":"IF(ISERROR(VLOOKUP(E407,'Časy cíl'!$B$2:$C$252,2,FALSE)),\"\",VLOOKUP(E407,'Časy cíl'!$B$2:$C$252,2,FALSE))","v":""},"",60,{"$f":"VLOOKUP(C407,'Kategorie - UPRAV ROK!'!$A$18:$C$21,3,FALSE)","v":{"$error":"#N/A"}}]
[{"$nulls":3},{"$f":"IF(B408=\"\",\"\",VLOOKUP('Kategorie - UPRAV ROK!'!$B$1-B408,'Kategorie - UPRAV ROK!'!$A$5:$G$13,OFFSET(B408,0,9)+3,TRUE))","v":""},null,null,"10:00:00",{"$f":"IF(ISERROR(VLOOKUP(E408,'Časy cíl'!$B$2:$C$252,2,FALSE)),\"\",VLOOKUP(E408,'Časy cíl'!$B$2:$C$252,2,FALSE))","v":""},"",61,{"$f":"VLOOKUP(C408,'Kategorie - UPRAV ROK!'!$A$18:$C$21,3,FALSE)","v":{"$error":"#N/A"}}]
[{"$nulls":3},{"$f":"IF(B409=\"\",\"\",VLOOKUP('Kategorie - UPRAV ROK!'!$B$1-B409,'Kategorie - UPRAV ROK!'!$A$5:$G$13,OFFSET(B409,0,9)+3,TRUE))","v":""},null,null,"10:00:00",{"$f":"IF(ISERROR(VLOOKUP(E409,'Časy cíl'!$B$2:$C$252,2,FALSE)),\"\",VLOOKUP(E409,'Časy cíl'!$B$2:$C$252,2,FALSE))","v":""},"",62,{"$f":"VLOOKUP(C409,'Kategorie - UPRAV ROK!'!$A$18:$C$21,3,FALSE)","v":{"$error":"#N/A"}}]
[{"$nulls":3},{"$f":"IF(B410=\"\",\"\",VLOOKUP('Kategorie - UPRAV ROK!'!$B$1-B410,'Kategorie - UPRAV ROK!'!$A$5:$G$13,OFFSET(B410,0,9)+3,TRUE))","v":""},null,null,"10:00:00",{"$f":"IF(ISERROR(VLOOKUP(E410,'Časy cíl'!$B$2:$C$252,2,FALSE)),\"\",VLOOKUP(E410,'Časy cíl'!$B$2:$C$252,2,FALSE))","v":""},"",63,{"$f":"VLOOKUP(C410,'Kategorie - UPRAV ROK!'!$A$18:$C$21,3,FALSE)","v":{"$error":"#N/A"}}]
[{"$nulls":3},{"$f":"IF(B411=\"\",\"\",VLOOKUP('Kategorie - UPRAV ROK!'!$B$1-B411,'Kategorie - UPRAV ROK!'!$A$5:$G$13,OFFSET(B411,0,9)+3,TRUE))","v":""},null,null,"10:00:00",{"$f":"IF(ISERROR(VLOOKUP(E411,'Časy cíl'!$B$2:$C$252,2,FALSE)),\"\",VLOOKUP(E411,'Časy cíl'!$B$2:$C$252,2,FALSE))","v":""},"",64,{"$f":"VLOOKUP(C411,'Kategorie - UPRAV ROK!'!$A$18:$C$21,3,FALSE)","v":{"$error":"#N/A"}}]
[{"$nulls":3},{"$f":"IF(B412=\"\",\"\",VLOOKUP('Kategorie - UPRAV ROK!'!$B$1-B412,'Kategorie - UPRAV ROK!'!$A$5:$G$13,OFFSET(B412,0,9)+3,TRUE))","v":""},null,null,"10:00:00",{"$f":"IF(ISERROR(VLOOKUP(E412,'Časy cíl'!$B$2:$C$252,2,FALSE)),\"\",VLOOKUP(E412,'Časy cíl'!$B$2:$C$252,2,FALSE))","v":""},"",65,{"$f":"VLOOKUP(C412,'Kategorie - UPRAV ROK!'!$A$18:$C$21,3,FALSE)","v":{"$error":"#N/A"}}]
[{"$nulls":3},{"$f":"IF(B413=\"\",\"\",VLOOKUP('Kategorie - UPRAV ROK!'!$B$1-B413,'Kategorie - UPRAV ROK!'!$A$5:$G$13,OFFSET(B413,0,9)+3,TRUE))","v":""},null,null,"10:00:00",{"$f":"IF(ISERROR(VLOOKUP(E413,'Časy cíl'!$B$2:$C$252,2,FALSE)),\"\",VLOOKUP(E413,'Časy cíl'!$B$2:$C$252,2,FALSE))","v":""},"",66,{"$f":"VLOOKUP(C413,'Kategorie - UPRAV ROK!'!$A$18:$C$21,3,FALSE)","v":{"$error":"#N/A"}}]
[{"$nulls":3},{"$f":"IF(B414=\"\",\"\",VLOOKUP('Kategorie - UPRAV ROK!'!$B$1-B414,'Kategorie - UPRAV ROK!'!$A$5:$G$13,OFFSET(B414,0,9)+3,TRUE))","v":""},null,null,"10:00:00",{"$f":"IF(ISERROR(VLOOKUP(E414,'Časy cíl'!$B$2:$C$252,2,FALSE)),\"\",VLOOKUP(E414,'Časy cíl'!$B$2:$C$252,2,FALSE))","v":""},"",67,{"$f":"VLOOKUP(C414,'Kategorie - UPRAV ROK!'!$A$18:$C$21,3,FALSE)","v":{"$error":"#N/A"}}]
[{"$nulls":3},{"$f":"IF(B415=\"\",\"\",VLOOKUP('Kategorie - UPRAV ROK!'!$B$1-B415,'Kategorie - UPRAV ROK!'!$A$5:$G$13,OFFSET(B415,0,9)+3,TRUE))","v":""},null,null,"10:00:00",{"$f":"IF(ISERROR(VLOOKUP(E415,'Časy cíl'!$B$2:$C$252,2,FALSE)),\"\",VLOOKUP(E415,'Časy cíl'!$B$2:$C$252,2,FALSE))","v":""},"",68,{"$f":"VLOOKUP(C415,'Kategorie - UPRAV ROK!'!$A$18:$C$21,3,FALSE)","v":{"$error":"#N/A"}}]
[{"$nulls":3},{"$f":"IF(B416=\"\",\"\",VLOOKUP('Kategorie - UPRAV ROK!'!$B$1-B416,'Kategorie - UPRAV ROK!'!$A$5:$G$13,OFFSET(B416,0,9)+3,TRUE))","v":""},null,null,"10:00:00",{"$f":"IF(ISERROR(VLOOKUP(E416,'Časy cíl'!$B$2:$C$252,2,FALSE)),\"\",VLOOKUP(E416,'Časy cíl'!$B$2:$C$252,2,FALSE))","v":""},"",69,{"$f":"VLOOKUP(C416,'Kategorie - UPRAV ROK!'!$A$18:$C$21,3,FALSE)","v":{"$error":"#N/A"}}]
[{"$nulls":3},{"$f":"IF(B417=\"\",\"\",VLOOKUP('Kategorie - UPRAV ROK!'!$B$1-B417,'Kategorie - UPRAV ROK!'!$A$5:$G$13,OFFSET(B417,0,9)+3,TRUE))","v":""},null,null,"10:00:00",{"$f":"IF(ISERROR(VLOOKUP(E417,'Časy cíl'!$B$2:$C$252,2,FALSE)),\"\",VLOOKUP(E417,'Časy cíl'!$B$2:$C$252,2,FALSE))","v":""},"",70,{"$f":"VLOOKUP(C417,'Kategorie - UPRAV ROK!'!$A$18:$C$21,3,FALSE)","v":{"$error":"#N/A"}}]
[{"$nulls":3},{"$f":"IF(B418=\"\",\"\",VLOOKUP('Kategorie - UPRAV ROK!'!$B$1-B418,'Kategorie - UPRAV ROK!'!$A$5:$G$13,OFFSET(B418,0,9)+3,TRUE))","v":""},null,null,"10:00:00",{"$f":"IF(ISERROR(VLOOKUP(E418,'Časy cíl'!$B$2:$C$252,2,FALSE)),\"\",VLOOKUP(E418,'Časy cíl'!$B$2:$C$252,2,FALSE))","v":""},"",71,{"$f":"VLOOKUP(C418,'Kategorie - UPRAV ROK!'!$A$18:$C$21,3,FALSE)","v":{"$error":"#N/A"}}]
[{"$nulls":3},{"$f":"IF(B419=\"\",\"\",VLOOKUP('Kategorie - UPRAV ROK!'!$B$1-B419,'Kategorie - UPRAV ROK!'!$A$5:$G$13,OFFSET(B419,0,9)+3,TRUE))","v":""},null,null,"10:00:00",{"$f":"IF(ISERROR(VLOOKUP(E419,'Časy cíl'!$B$2:$C$252,2,FALSE)),\"\",VLOOKUP(E419,'Časy cíl'!$B$2:$C$252,2,FALSE))","v":""},"",72,{"$f":"VLOOKUP(C419,'Kategorie - UPRAV ROK!'!$A$18:$C$21,3,FALSE)","v":{"$error":"#N/A"}}]
[{"$nulls":3},{"$f":"IF(B420=\"\",\"\",VLOOKUP('Kategorie - UPRAV ROK!'!$B$1-B420,'Kategorie - UPRAV ROK!'!$A$5:$G$13,OFFSET(B420,0,9)+3,TRUE))","v":""},null,null,"10:00:00",{"$f":"IF(ISERROR(VLOOKUP(E420,'Časy cíl'!$B$2:$C$252,2,FALSE)),\"\",VLOOKUP(E420,'Časy cíl'!$B$2:$C$252,2,FALSE))","v":""},"",73,{"$f":"VLOOKUP(C420,'Kategorie - UPRAV ROK!'!$A$18:$C$21,3,FALSE)","v":{"$error":"#N/A"}}]
[{"$nulls":3},{"$f":"IF(B421=\"\",\"\",VLOOKUP('Kategorie - UPRAV ROK!'!$B$1-B421,'Kategorie - UPRAV ROK!'!$A$5:$G$13,OFFSET(B421,0,9)+3,TRUE))","v":""},null,null,"10:00:00",{"$f":"IF(ISERROR(VLOOKUP(E421,'Časy cíl'!$B$2:$C$252,2,FALSE)),\"\",VLOOKUP(E421,'Časy cíl'!$B$2:$C$252,2,FALSE))","v":""},"",74,{"$f":"VLOOKUP(C421,'Kategorie - UPRAV ROK!'!$A$18:$C$21,3,FALSE)","v":{"$error":"#N/A"}}]
[{"$nulls":3},{"$f":"IF(B422=\"\",\"\",VLOOKUP('Kategorie - UPRAV ROK!'!$B$1-B422,'Kategorie - UPRAV ROK!'!$A$5:$G$13,OFFSET(B422,0,9)+3,TRUE))","v":""},null,null,"10:00:00",{"$f":"IF(ISERROR(VLOOKUP(E422,'Časy cíl'!$B$2:$C$252,2,FALSE)),\"\",VLOOKUP(E422,'Časy cíl'!$B$2:$C$252,2,FALSE))","v":""},"",75,{"$f":"VLOOKUP(C422,'Kategorie - UPRAV ROK!'!$A$18:$C$21,3,FALSE)","v":{"$error":"#N/A"}}]
[{"$nulls":3},{"$f":"IF(B423=\"\",\"\",VLOOKUP('Kategorie - UPRAV ROK!'!$B$1-B423,'Kategorie - UPRAV ROK!'!$A$5:$G$13,OFFSET(B423,0,9)+3,TRUE))","v":""},null,null,{"$f":"$N$14+F423/(60*24)","v":"10:00:00"},{"$f":"IF(ISERROR(VLOOKUP(E423,'Časy cíl'!$B$2:$C$252,2,FALSE)),\"\",VLOOKUP(E423,'Časy cíl'!$B$2:$C$252,2,FALSE))","v":""},"",76,{"$f":"VLOOKUP(C423,'Kategorie - UPRAV ROK!'!$A$18:$C$21,3,FALSE)","v":{"$error":"#N/A"}}]
[{"$nulls":3},{"$f":"IF(B424=\"\",\"\",VLOOKUP('Kategorie - UPRAV ROK!'!$B$1-B424,'Kategorie - UPRAV ROK!'!$A$5:$G$13,OFFSET(B424,0,9)+3,TRUE))","v":""},null,null,"10:00:00",{"$f":"IF(ISERROR(VLOOKUP(E424,'Časy cíl'!$B$2:$C$252,2,FALSE)),\"\",VLOOKUP(E424,'Časy cíl'!$B$2:$C$252,2,FALSE))","v":""},"",77,{"$f":"VLOOKUP(C424,'Kategorie - UPRAV ROK!'!$A$18:$C$21,3,FALSE)","v":{"$error":"#N/A"}}]
[{"$nulls":3},{"$f":"IF(B425=\"\",\"\",VLOOKUP('Kategorie - UPRAV ROK!'!$B$1-B425,'Kategorie - UPRAV ROK!'!$A$5:$G$13,OFFSET(B425,0,9)+3,TRUE))","v":""},null,null,"10:00:00",{"$f":"IF(ISERROR(VLOOKUP(E425,'Časy cíl'!$B$2:$C$252,2,FALSE)),\"\",VLOOKUP(E425,'Časy cíl'!$B$2:$C$252,2,FALSE))","v":""},"",78,{"$f":"VLOOKUP(C425,'Kategorie - UPRAV ROK!'!$A$18:$C$21,3,FALSE)","v":{"$error":"#N/A"}}]
[{"$nulls":3},{"$f":"IF(B426=\"\",\"\",VLOOKUP('Kategorie - UPRAV ROK!'!$B$1-B426,'Kategorie - UPRAV ROK!'!$A$5:$G$13,OFFSET(B426,0,9)+3,TRUE))","v":""},null,null,"10:00:00",{"$f":"IF(ISERROR(VLOOKUP(E426,'Časy cíl'!$B$2:$C$252,2,FALSE)),\"\",VLOOKUP(E426,'Časy cíl'!$B$2:$C$252,2,FALSE))","v":""},"",79,{"$f":"VLOOKUP(C426,'Kategorie - UPRAV ROK!'!$A$18:$C$21,3,FALSE)","v":{"$error":"#N/A"}}]
[{"$nulls":3},{"$f":"IF(B427=\"\",\"\",VLOOKUP('Kategorie - UPRAV ROK!'!$B$1-B427,'Kategorie - UPRAV ROK!'!$A$5:$G$13,OFFSET(B427,0,9)+3,TRUE))","v":""},null,null,"10:00:00",{"$f":"IF(ISERROR(VLOOKUP(E427,'Časy cíl'!$B$2:$C$252,2,FALSE)),\"\",VLOOKUP(E427,'Časy cíl'!$B$2:$C$252,2,FALSE))","v":""},"",80,{"$f":"VLOOKUP(C427,'Kategorie - UPRAV ROK!'!$A$18:$C$21,3,FALSE)","v":{"$error":"#N/A"}}]
[{"$nulls":3},{"$f":"IF(B428=\"\",\"\",VLOOKUP('Kategorie - UPRAV ROK!'!$B$1-B428,'Kategorie - UPRAV ROK!'!$A$5:$G$13,OFFSET(B428,0,9)+3,TRUE))","v":""},null,null,"10:00:00",{"$f":"IF(ISERROR(VLOOKUP(E428,'Časy cíl'!$B$2:$C$252,2,FALSE)),\"\",VLOOKUP(E428,'Časy cíl'!$B$2:$C$252,2,FALSE))","v":""},"",81,{"$f":"VLOOKUP(C428,'Kategorie - UPRAV ROK!'!$A$18:$C$21,3,FALSE)","v":{"$error":"#N/A"}}]
[{"$nulls":3},{"$f":"IF(B429=\"\",\"\",VLOOKUP('Kategorie - UPRAV ROK!'!$B$1-B429,'Kategorie - UPRAV ROK!'!$A$5:$G$13,OFFSET(B429,0,9)+3,TRUE))","v":""},null,null,"10:00:00",{"$f":"IF(ISERROR(VLOOKUP(E429,'Časy cíl'!$B$2:$C$252,2,FALSE)),\"\",VLOOKUP(E429,'Časy cíl'!$B$2:$C$252,2,FALSE))","v":""},"",82,{"$f":"VLOOKUP(C429,'Kategorie - UPRAV ROK!'!$A$18:$C$21,3,FALSE)","v":{"$error":"#N/A"}}]
[{"$nulls":3},{"$f":"IF(B430=\"\",\"\",VLOOKUP('Kategorie - UPRAV ROK!'!$B$1-B430,'Kategorie - UPRAV ROK!'!$A$5:$G$13,OFFSET(B430,0,9)+3,TRUE))","v":""},null,null,"10:00:00",{"$f":"IF(ISERROR(VLOOKUP(E430,'Časy cíl'!$B$2:$C$252,2,FALSE)),\"\",VLOOKUP(E430,'Časy cíl'!$B$2:$C$252,2,FALSE))","v":""},"",83,{"$f":"VLOOKUP(C430,'Kategorie - UPRAV ROK!'!$A$18:$C$21,3,FALSE)","v":{"$error":"#N/A"}}]
[{"$nulls":3},{"$f":"IF(B431=\"\",\"\",VLOOKUP('Kategorie - UPRAV ROK!'!$B$1-B431,'Kategorie - UPRAV ROK!'!$A$5:$G$13,OFFSET(B431,0,9)+3,TRUE))","v":""},null,null,"10:00:00",{"$f":"IF(ISERROR(VLOOKUP(E431,'Časy cíl'!$B$2:$C$252,2,FALSE)),\"\",VLOOKUP(E431,'Časy cíl'!$B$2:$C$252,2,FALSE))","v":""},"",84,{"$f":"VLOOKUP(C431,'Kategorie - UPRAV ROK!'!$A$18:$C$21,3,FALSE)","v":{"$error":"#N/A"}}]
[{"$nulls":3},{"$f":"IF(B432=\"\",\"\",VLOOKUP('Kategorie - UPRAV ROK!'!$B$1-B432,'Kategorie - UPRAV ROK!'!$A$5:$G$13,OFFSET(B432,0,9)+3,TRUE))","v":""},null,null,"10:00:00",{"$f":"IF(ISERROR(VLOOKUP(E432,'Časy cíl'!$B$2:$C$252,2,FALSE)),\"\",VLOOKUP(E432,'Časy cíl'!$B$2:$C$252,2,FALSE))","v":""},"",85,{"$f":"VLOOKUP(C432,'Kategorie - UPRAV ROK!'!$A$18:$C$21,3,FALSE)","v":{"$error":"#N/A"}}]
[{"$nulls":3},{"$f":"IF(B433=\"\",\"\",VLOOKUP('Kategorie - UPRAV ROK!'!$B$1-B433,'Kategorie - UPRAV ROK!'!$A$5:$G$13,OFFSET(B433,0,9)+3,TRUE))","v":""},null,null,"10:00:00",{"$f":"IF(ISERROR(VLOOKUP(E433,'Časy cíl'!$B$2:$C$252,2,FALSE)),\"\",VLOOKUP(E433,'Časy cíl'!$B$2:$C$252,2,FALSE))","v":""},"",86,{"$f":"VLOOKUP(C433,'Kategorie - UPRAV ROK!'!$A$18:$C$21,3,FALSE)","v":{"$error":"#N/A"}}]
[{"$nulls":3},{"$f":"IF(B434=\"\",\"\",VLOOKUP('Kategorie - UPRAV ROK!'!$B$1-B434,'Kategorie - UPRAV ROK!'!$A$5:$G$13,OFFSET(B434,0,9)+3,TRUE))","v":""},null,null,"10:00:00",{"$f":"IF(ISERROR(VLOOKUP(E434,'Časy cíl'!$B$2:$C$252,2,FALSE)),\"\",VLOOKUP(E434,'Časy cíl'!$B$2:$C$252,2,FALSE))","v":""},"",87,{"$f":"VLOOKUP(C434,'Kategorie - UPRAV ROK!'!$A$18:$C$21,3,FALSE)","v":{"$error":"#N/A"}}]
[{"$nulls":3},{"$f":"IF(B435=\"\",\"\",VLOOKUP('Kategorie - UPRAV ROK!'!$B$1-B435,'Kategorie - UPRAV ROK!'!$A$5:$G$13,OFFSET(B435,0,9)+3,TRUE))","v":""},null,null,"10:00:00",{"$f":"IF(ISERROR(VLOOKUP(E435,'Časy cíl'!$B$2:$C$252,2,FALSE)),\"\",VLOOKUP(E435,'Časy cíl'!$B$2:$C$252,2,FALSE))","v":""},"",88,{"$f":"VLOOKUP(C435,'Kategorie - UPRAV ROK!'!$A$18:$C$21,3,FALSE)","v":{"$error":"#N/A"}}]
[{"$nulls":3},{"$f":"IF(B436=\"\",\"\",VLOOKUP('Kategorie - UPRAV ROK!'!$B$1-B436,'Kategorie - UPRAV ROK!'!$A$5:$G$13,OFFSET(B436,0,9)+3,TRUE))","v":""},null,null,"10:00:00",{"$f":"IF(ISERROR(VLOOKUP(E436,'Časy cíl'!$B$2:$C$252,2,FALSE)),\"\",VLOOKUP(E436,'Časy cíl'!$B$2:$C$252,2,FALSE))","v":""},"",89,{"$f":"VLOOKUP(C436,'Kategorie - UPRAV ROK!'!$A$18:$C$21,3,FALSE)","v":{"$error":"#N/A"}}]
[{"$nulls":3},{"$f":"IF(B437=\"\",\"\",VLOOKUP('Kategorie - UPRAV ROK!'!$B$1-B437,'Kategorie - UPRAV ROK!'!$A$5:$G$13,OFFSET(B437,0,9)+3,TRUE))","v":""},null,null,"10:00:00",{"$f":"IF(ISERROR(VLOOKUP(E437,'Časy cíl'!$B$2:$C$252,2,FALSE)),\"\",VLOOKUP(E437,'Časy cíl'!$B$2:$C$252,2,FALSE))","v":""},"",90,{"$f":"VLOOKUP(C437,'Kategorie - UPRAV ROK!'!$A$18:$C$21,3,FALSE)","v":{"$error":"#N/A"}}]
[{"$nulls":3},{"$f":"IF(B438=\"\",\"\",VLOOKUP('Kategorie - UPRAV ROK!'!$B$1-B438,'Kategorie - UPRAV ROK!'!$A$5:$G$13,OFFSET(B438,0,9)+3,TRUE))","v":""},null,null,"10:00:00",{"$f":"IF(ISERROR(VLOOKUP(E438,'Časy cíl'!$B$2:$C$252,2,FALSE)),\"\",VLOOKUP(E438,'Časy cíl'!$B$2:$C$252,2,FALSE))","v":""},"",91,{"$f":"VLOOKUP(C438,'Kategorie - UPRAV ROK!'!$A$18:$C$21,3,FALSE)","v":{"$error":"#N/A"}}]
[{"$nulls":3},{"$f":"IF(B439=\"\",\"\",VLOOKUP('Kategorie - UPRAV ROK!'!$B$1-B439,'Kategorie - UPRAV ROK!'!$A$5:$G$13,OFFSET(B439,0,9)+3,TRUE))","v":""},null,null,"10:00:00",{"$f":"IF(ISERROR(VLOOKUP(E439,'Časy cíl'!$B$2:$C$252,2,FALSE)),\"\",VLOOKUP(E439,'Časy cíl'!$B$2:$C$252,2,FALSE))","v":""},"",92,{"$f":"VLOOKUP(C439,'Kategorie - UPRAV ROK!'!$A$18:$C$21,3,FALSE)","v":{"$error":"#N/A"}}]
[{"$nulls":3},{"$f":"IF(B440=\"\",\"\",VLOOKUP('Kategorie - UPRAV ROK!'!$B$1-B440,'Kategorie - UPRAV ROK!'!$A$5:$G$13,OFFSET(B440,0,9)+3,TRUE))","v":""},null,null,"10:00:00",{"$f":"IF(ISERROR(VLOOKUP(E440,'Časy cíl'!$B$2:$C$252,2,FALSE)),\"\",VLOOKUP(E440,'Časy cíl'!$B$2:$C$252,2,FALSE))","v":""},"",93,{"$f":"VLOOKUP(C440,'Kategorie - UPRAV ROK!'!$A$18:$C$21,3,FALSE)","v":{"$error":"#N/A"}}]
[{"$nulls":3},{"$f":"IF(B441=\"\",\"\",VLOOKUP('Kategorie - UPRAV ROK!'!$B$1-B441,'Kategorie - UPRAV ROK!'!$A$5:$G$13,OFFSET(B441,0,9)+3,TRUE))","v":""},null,null,"10:00:00",{"$f":"IF(ISERROR(VLOOKUP(E441,'Časy cíl'!$B$2:$C$252,2,FALSE)),\"\",VLOOKUP(E441,'Časy cíl'!$B$2:$C$252,2,FALSE))","v":""},"",94,{"$f":"VLOOKUP(C441,'Kategorie - UPRAV ROK!'!$A$18:$C$21,3,FALSE)","v":{"$error":"#N/A"}}]
[{"$nulls":3},{"$f":"IF(B442=\"\",\"\",VLOOKUP('Kategorie - UPRAV ROK!'!$B$1-B442,'Kategorie - UPRAV ROK!'!$A$5:$G$13,OFFSET(B442,0,9)+3,TRUE))","v":""},null,null,"10:00:00",{"$f":"IF(ISERROR(VLOOKUP(E442,'Časy cíl'!$B$2:$C$252,2,FALSE)),\"\",VLOOKUP(E442,'Časy cíl'!$B$2:$C$252,2,FALSE))","v":""},"",95,{"$f":"VLOOKUP(C442,'Kategorie - UPRAV ROK!'!$A$18:$C$21,3,FALSE)","v":{"$error":"#N/A"}}]
[{"$nulls":3},{"$f":"IF(B443=\"\",\"\",VLOOKUP('Kategorie - UPRAV ROK!'!$B$1-B443,'Kategorie - UPRAV ROK!'!$A$5:$G$13,OFFSET(B443,0,9)+3,TRUE))","v":""},null,null,"10:00:00",{"$f":"IF(ISERROR(VLOOKUP(E443,'Časy cíl'!$B$2:$C$252,2,FALSE)),\"\",VLOOKUP(E443,'Časy cíl'!$B$2:$C$252,2,FALSE))","v":""},"",96,{"$f":"VLOOKUP(C443,'Kategorie - UPRAV ROK!'!$A$18:$C$21,3,FALSE)","v":{"$error":"#N/A"}}]
[{"$nulls":3},{"$f":"IF(B444=\"\",\"\",VLOOKUP('Kategorie - UPRAV ROK!'!$B$1-B444,'Kategorie - UPRAV ROK!'!$A$5:$G$13,OFFSET(B444,0,9)+3,TRUE))","v":""},null,null,"10:00:00",{"$f":"IF(ISERROR(VLOOKUP(E444,'Časy cíl'!$B$2:$C$252,2,FALSE)),\"\",VLOOKUP(E444,'Časy cíl'!$B$2:$C$252,2,FALSE))","v":""},"",97,{"$f":"VLOOKUP(C444,'Kategorie - UPRAV ROK!'!$A$18:$C$21,3,FALSE)","v":{"$error":"#N/A"}}]
[{"$nulls":3},{"$f":"IF(B445=\"\",\"\",VLOOKUP('Kategorie - UPRAV ROK!'!$B$1-B445,'Kategorie - UPRAV ROK!'!$A$5:$G$13,OFFSET(B445,0,9)+3,TRUE))","v":""},null,null,"10:00:00",{"$f":"IF(ISERROR(VLOOKUP(E445,'Časy cíl'!$B$2:$C$252,2,FALSE)),\"\",VLOOKUP(E445,'Časy cíl'!$B$2:$C$252,2,FALSE))","v":""},"",98,{"$f":"VLOOKUP(C445,'Kategorie - UPRAV ROK!'!$A$18:$C$21,3,FALSE)","v":{"$error":"#N/A"}}]
[{"$nulls":3},{"$f":"IF(B446=\"\",\"\",VLOOKUP('Kategorie - UPRAV ROK!'!$B$1-B446,'Kategorie - UPRAV ROK!'!$A$5:$G$13,OFFSET(B446,0,9)+3,TRUE))","v":""},null,null,"10:00:00",{"$f":"IF(ISERROR(VLOOKUP(E446,'Časy cíl'!$B$2:$C$252,2,FALSE)),\"\",VLOOKUP(E446,'Časy cíl'!$B$2:$C$252,2,FALSE))","v":""},"",99,{"$f":"VLOOKUP(C446,'Kategorie - UPRAV ROK!'!$A$18:$C$21,3,FALSE)","v":{"$error":"#N/A"}}]
[{"$nulls":3},{"$f":"IF(B447=\"\",\"\",VLOOKUP('Kategorie - UPRAV ROK!'!$B$1-B447,'Kategorie - UPRAV ROK!'!$A$5:$G$13,OFFSET(B447,0,9)+3,TRUE))","v":""},null,null,"10:00:00",{"$f":"IF(ISERROR(VLOOKUP(E447,'Časy cíl'!$B$2:$C$252,2,FALSE)),\"\",VLOOKUP(E447,'Časy cíl'!$B$2:$C$252,2,FALSE))","v":""},"",100,{"$f":"VLOOKUP(C447,'Kategorie - UPRAV ROK!'!$A$18:$C$21,3,FALSE)","v":{"$error":"#N/A"}}]
[{"$nulls":3},{"$f":"IF(B448=\"\",\"\",VLOOKUP('Kategorie - UPRAV ROK!'!$B$1-B448,'Kategorie - UPRAV ROK!'!$A$5:$G$13,OFFSET(B448,0,9)+3,TRUE))","v":""},null,null,"10:00:00",{"$f":"IF(ISERROR(VLOOKUP(E448,'Časy cíl'!$B$2:$C$252,2,FALSE)),\"\",VLOOKUP(E448,'Časy cíl'!$B$2:$C$252,2,FALSE))","v":""},"",101,{"$f":"VLOOKUP(C448,'Kategorie - UPRAV ROK!'!$A$18:$C$21,3,FALSE)","v":{"$error":"#N/A"}}]
[{"$nulls":3},{"$f":"IF(B449=\"\",\"\",VLOOKUP('Kategorie - UPRAV ROK!'!$B$1-B449,'Kategorie - UPRAV ROK!'!$A$5:$G$13,OFFSET(B449,0,9)+3,TRUE))","v":""},null,null,"10:00:00",{"$f":"IF(ISERROR(VLOOKUP(E449,'Časy cíl'!$B$2:$C$252,2,FALSE)),\"\",VLOOKUP(E449,'Časy cíl'!$B$2:$C$252,2,FALSE))","v":""},"",102,{"$f":"VLOOKUP(C449,'Kategorie - UPRAV ROK!'!$A$18:$C$21,3,FALSE)","v":{"$error":"#N/A"}}]
[{"$nulls":3},{"$f":"IF(B450=\"\",\"\",VLOOKUP('Kategorie - UPRAV ROK!'!$B$1-B450,'Kategorie - UPRAV ROK!'!$A$5:$G$13,OFFSET(B450,0,9)+3,TRUE))","v":""},null,null,"10:00:00",{"$f":"IF(ISERROR(VLOOKUP(E450,'Časy cíl'!$B$2:$C$252,2,FALSE)),\"\",VLOOKUP(E450,'Časy cíl'!$B$2:$C$252,2,FALSE))","v":""},"",103,{"$f":"VLOOKUP(C450,'Kategorie - UPRAV ROK!'!$A$18:$C$21,3,FALSE)","v":{"$error":"#N/A"}}]
[{"$nulls":3},{"$f":"IF(B451=\"\",\"\",VLOOKUP('Kategorie - UPRAV ROK!'!$B$1-B451,'Kategorie - UPRAV ROK!'!$A$5:$G$13,OFFSET(B451,0,9)+3,TRUE))","v":""},null,null,"10:00:00",{"$f":"IF(ISERROR(VLOOKUP(E451,'Časy cíl'!$B$2:$C$252,2,FALSE)),\"\",VLOOKUP(E451,'Časy cíl'!$B$2:$C$252,2,FALSE))","v":""},{"$f":"IF(ISERROR(H451-G451),\"\",IF(H451=0,\"chybí čas\",H451-G451))","v":""},{"$f":"IF(D451=D450,J450+1,1)","v":104},{"$f":"VLOOKUP(C451,'Kategorie - UPRAV ROK!'!$A$18:$C$21,3,FALSE)","v":{"$error":"#N/A"}}]
[{"$nulls":3},{"$f":"IF(B452=\"\",\"\",VLOOKUP('Kategorie - UPRAV ROK!'!$B$1-B452,'Kategorie - UPRAV ROK!'!$A$5:$G$13,OFFSET(B452,0,9)+3,TRUE))","v":""},null,null,"10:00:00",{"$f":"IF(ISERROR(VLOOKUP(E452,'Časy cíl'!$B$2:$C$252,2,FALSE)),\"\",VLOOKUP(E452,'Časy cíl'!$B$2:$C$252,2,FALSE))","v":""},"",105,{"$f":"VLOOKUP(C452,'Kategorie - UPRAV ROK!'!$A$18:$C$21,3,FALSE)","v":{"$error":"#N/A"}}]
[{"$nulls":3},{"$f":"IF(B453=\"\",\"\",VLOOKUP('Kategorie - UPRAV ROK!'!$B$1-B453,'Kategorie - UPRAV ROK!'!$A$5:$G$13,OFFSET(B453,0,9)+3,TRUE))","v":""},null,null,"10:00:00",{"$f":"IF(ISERROR(VLOOKUP(E453,'Časy cíl'!$B$2:$C$252,2,FALSE)),\"\",VLOOKUP(E453,'Časy cíl'!$B$2:$C$252,2,FALSE))","v":""},"",106,{"$f":"VLOOKUP(C453,'Kategorie - UPRAV ROK!'!$A$18:$C$21,3,FALSE)","v":{"$error":"#N/A"}}]
[{"$nulls":3},{"$f":"IF(B454=\"\",\"\",VLOOKUP('Kategorie - UPRAV ROK!'!$B$1-B454,'Kategorie - UPRAV ROK!'!$A$5:$G$13,OFFSET(B454,0,9)+3,TRUE))","v":""},null,null,"10:00:00",{"$f":"IF(ISERROR(VLOOKUP(E454,'Časy cíl'!$B$2:$C$252,2,FALSE)),\"\",VLOOKUP(E454,'Časy cíl'!$B$2:$C$252,2,FALSE))","v":""},"",107,{"$f":"VLOOKUP(C454,'Kategorie - UPRAV ROK!'!$A$18:$C$21,3,FALSE)","v":{"$error":"#N/A"}}]
[{"$nulls":3},{"$f":"IF(B455=\"\",\"\",VLOOKUP('Kategorie - UPRAV ROK!'!$B$1-B455,'Kategorie - UPRAV ROK!'!$A$5:$G$13,OFFSET(B455,0,9)+3,TRUE))","v":""},null,null,"10:00:00",{"$f":"IF(ISERROR(VLOOKUP(E455,'Časy cíl'!$B$2:$C$252,2,FALSE)),\"\",VLOOKUP(E455,'Časy cíl'!$B$2:$C$252,2,FALSE))","v":""},"",108,{"$f":"VLOOKUP(C455,'Kategorie - UPRAV ROK!'!$A$18:$C$21,3,FALSE)","v":{"$error":"#N/A"}}]
[{"$nulls":3},{"$f":"IF(B456=\"\",\"\",VLOOKUP('Kategorie - UPRAV ROK!'!$B$1-B456,'Kategorie - UPRAV ROK!'!$A$5:$G$13,OFFSET(B456,0,9)+3,TRUE))","v":""},null,null,"10:00:00",{"$f":"IF(ISERROR(VLOOKUP(E456,'Časy cíl'!$B$2:$C$252,2,FALSE)),\"\",VLOOKUP(E456,'Časy cíl'!$B$2:$C$252,2,FALSE))","v":""},"",109,{"$f":"VLOOKUP(C456,'Kategorie - UPRAV ROK!'!$A$18:$C$21,3,FALSE)","v":{"$error":"#N/A"}}]
[{"$nulls":3},{"$f":"IF(B457=\"\",\"\",VLOOKUP('Kategorie - UPRAV ROK!'!$B$1-B457,'Kategorie - UPRAV ROK!'!$A$5:$G$13,OFFSET(B457,0,9)+3,TRUE))","v":""},null,null,"10:00:00",{"$f":"IF(ISERROR(VLOOKUP(E457,'Časy cíl'!$B$2:$C$252,2,FALSE)),\"\",VLOOKUP(E457,'Časy cíl'!$B$2:$C$252,2,FALSE))","v":""},"",110,{"$f":"VLOOKUP(C457,'Kategorie - UPRAV ROK!'!$A$18:$C$21,3,FALSE)","v":{"$error":"#N/A"}}]
[{"$nulls":3},{"$f":"IF(B458=\"\",\"\",VLOOKUP('Kategorie - UPRAV ROK!'!$B$1-B458,'Kategorie - UPRAV ROK!'!$A$5:$G$13,OFFSET(B458,0,9)+3,TRUE))","v":""},null,null,"10:00:00",{"$f":"IF(ISERROR(VLOOKUP(E458,'Časy cíl'!$B$2:$C$252,2,FALSE)),\"\",VLOOKUP(E458,'Časy cíl'!$B$2:$C$252,2,FALSE))","v":""},"",111,{"$f":"VLOOKUP(C458,'Kategorie - UPRAV ROK!'!$A$18:$C$21,3,FALSE)","v":{"$error":"#N/A"}}]
[{"$nulls":3},{"$f":"IF(B459=\"\",\"\",VLOOKUP('Kategorie - UPRAV ROK!'!$B$1-B459,'Kategorie - UPRAV ROK!'!$A$5:$G$13,OFFSET(B459,0,9)+3,TRUE))","v":""},null,null,"10:00:00",{"$f":"IF(ISERROR(VLOOKUP(E459,'Časy cíl'!$B$2:$C$252,2,FALSE)),\"\",VLOOKUP(E459,'Časy cíl'!$B$2:$C$252,2,FALSE))","v":""},"",112,{"$f":"VLOOKUP(C459,'Kategorie - UPRAV ROK!'!$A$18:$C$21,3,FALSE)","v":{"$error":"#N/A"}}]
[{"$nulls":3},{"$f":"IF(B460=\"\",\"\",VLOOKUP('Kategorie - UPRAV ROK!'!$B$1-B460,'Kategorie - UPRAV ROK!'!$A$5:$G$13,OFFSET(B460,0,9)+3,TRUE))","v":""},null,null,"10:00:00",{"$f":"IF(ISERROR(VLOOKUP(E460,'Časy cíl'!$B$2:$C$252,2,FALSE)),\"\",VLOOKUP(E460,'Časy cíl'!$B$2:$C$252,2,FALSE))","v":""},"",113,{"$f":"VLOOKUP(C460,'Kategorie - UPRAV ROK!'!$A$18:$C$21,3,FALSE)","v":{"$error":"#N/A"}}]
[{"$nulls":3},{"$f":"IF(B461=\"\",\"\",VLOOKUP('Kategorie - UPRAV ROK!'!$B$1-B461,'Kategorie - UPRAV ROK!'!$A$5:$G$13,OFFSET(B461,0,9)+3,TRUE))","v":""},null,null,"10:00:00",{"$f":"IF(ISERROR(VLOOKUP(E461,'Časy cíl'!$B$2:$C$252,2,FALSE)),\"\",VLOOKUP(E461,'Časy cíl'!$B$2:$C$252,2,FALSE))","v":""},"",114,{"$f":"VLOOKUP(C461,'Kategorie - UPRAV ROK!'!$A$18:$C$21,3,FALSE)","v":{"$error":"#N/A"}}]
[{"$nulls":3},{"$f":"IF(B462=\"\",\"\",VLOOKUP('Kategorie - UPRAV ROK!'!$B$1-B462,'Kategorie - UPRAV ROK!'!$A$5:$G$13,OFFSET(B462,0,9)+3,TRUE))","v":""},null,null,"10:00:00",{"$f":"IF(ISERROR(VLOOKUP(E462,'Časy cíl'!$B$2:$C$252,2,FALSE)),\"\",VLOOKUP(E462,'Časy cíl'!$B$2:$C$252,2,FALSE))","v":""},"",115,{"$f":"VLOOKUP(C462,'Kategorie - UPRAV ROK!'!$A$18:$C$21,3,FALSE)","v":{"$error":"#N/A"}}]
[{"$nulls":3},{"$f":"IF(B463=\"\",\"\",VLOOKUP('Kategorie - UPRAV ROK!'!$B$1-B463,'Kategorie - UPRAV ROK!'!$A$5:$G$13,OFFSET(B463,0,9)+3,TRUE))","v":""},null,null,"10:00:00",{"$f":"IF(ISERROR(VLOOKUP(E463,'Časy cíl'!$B$2:$C$252,2,FALSE)),\"\",VLOOKUP(E463,'Časy cíl'!$B$2:$C$252,2,FALSE))","v":""},"",116,{"$f":"VLOOKUP(C463,'Kategorie - UPRAV ROK!'!$A$18:$C$21,3,FALSE)","v":{"$error":"#N/A"}}]
[{"$nulls":3},{"$f":"IF(B464=\"\",\"\",VLOOKUP('Kategorie - UPRAV ROK!'!$B$1-B464,'Kategorie - UPRAV ROK!'!$A$5:$G$13,OFFSET(B464,0,9)+3,TRUE))","v":""},null,null,"10:00:00",{"$f":"IF(ISERROR(VLOOKUP(E464,'Časy cíl'!$B$2:$C$252,2,FALSE)),\"\",VLOOKUP(E464,'Časy cíl'!$B$2:$C$252,2,FALSE))","v":""},"",117,{"$f":"VLOOKUP(C464,'Kategorie - UPRAV ROK!'!$A$18:$C$21,3,FALSE)","v":{"$error":"#N/A"}}]
[{"$nulls":3},{"$f":"IF(B465=\"\",\"\",VLOOKUP('Kategorie - UPRAV ROK!'!$B$1-B465,'Kategorie - UPRAV ROK!'!$A$5:$G$13,OFFSET(B465,0,9)+3,TRUE))","v":""},null,null,"10:00:00",{"$f":"IF(ISERROR(VLOOKUP(E465,'Časy cíl'!$B$2:$C$252,2,FALSE)),\"\",VLOOKUP(E465,'Časy cíl'!$B$2:$C$252,2,FALSE))","v":""},"",118,{"$f":"VLOOKUP(C465,'Kategorie - UPRAV ROK!'!$A$18:$C$21,3,FALSE)","v":{"$error":"#N/A"}}]
[{"$nulls":3},{"$f":"IF(B466=\"\",\"\",VLOOKUP('Kategorie - UPRAV ROK!'!$B$1-B466,'Kategorie - UPRAV ROK!'!$A$5:$G$13,OFFSET(B466,0,9)+3,TRUE))","v":""},null,null,"10:00:00",{"$f":"IF(ISERROR(VLOOKUP(E466,'Časy cíl'!$B$2:$C$252,2,FALSE)),\"\",VLOOKUP(E466,'Časy cíl'!$B$2:$C$252,2,FALSE))","v":""},"",119,{"$f":"VLOOKUP(C466,'Kategorie - UPRAV ROK!'!$A$18:$C$21,3,FALSE)","v":{"$error":"#N/A"}}]
[{"$nulls":3},{"$f":"IF(B467=\"\",\"\",VLOOKUP('Kategorie - UPRAV ROK!'!$B$1-B467,'Kategorie - UPRAV ROK!'!$A$5:$G$13,OFFSET(B467,0,9)+3,TRUE))","v":""},null,null,"10:00:00",{"$f":"IF(ISERROR(VLOOKUP(E467,'Časy cíl'!$B$2:$C$252,2,FALSE)),\"\",VLOOKUP(E467,'Časy cíl'!$B$2:$C$252,2,FALSE))","v":""},"",120,{"$f":"VLOOKUP(C467,'Kategorie - UPRAV ROK!'!$A$18:$C$21,3,FALSE)","v":{"$error":"#N/A"}}]
[{"$nulls":3},{"$f":"IF(B468=\"\",\"\",VLOOKUP('Kategorie - UPRAV ROK!'!$B$1-B468,'Kategorie - UPRAV ROK!'!$A$5:$G$13,OFFSET(B468,0,9)+3,TRUE))","v":""},null,null,"10:00:00",{"$f":"IF(ISERROR(VLOOKUP(E468,'Časy cíl'!$B$2:$C$252,2,FALSE)),\"\",VLOOKUP(E468,'Časy cíl'!$B$2:$C$252,2,FALSE))","v":""},"",121,{"$f":"VLOOKUP(C468,'Kategorie - UPRAV ROK!'!$A$18:$C$21,3,FALSE)","v":{"$error":"#N/A"}}]
[{"$nulls":3},{"$f":"IF(B469=\"\",\"\",VLOOKUP('Kategorie - UPRAV ROK!'!$B$1-B469,'Kategorie - UPRAV ROK!'!$A$5:$G$13,OFFSET(B469,0,9)+3,TRUE))","v":""},null,null,"10:00:00",{"$f":"IF(ISERROR(VLOOKUP(E469,'Časy cíl'!$B$2:$C$252,2,FALSE)),\"\",VLOOKUP(E469,'Časy cíl'!$B$2:$C$252,2,FALSE))","v":""},"",122,{"$f":"VLOOKUP(C469,'Kategorie - UPRAV ROK!'!$A$18:$C$21,3,FALSE)","v":{"$error":"#N/A"}}]
[{"$nulls":3},{"$f":"IF(B470=\"\",\"\",VLOOKUP('Kategorie - UPRAV ROK!'!$B$1-B470,'Kategorie - UPRAV ROK!'!$A$5:$G$13,OFFSET(B470,0,9)+3,TRUE))","v":""},null,null,"10:00:00",{"$f":"IF(ISERROR(VLOOKUP(E470,'Časy cíl'!$B$2:$C$252,2,FALSE)),\"\",VLOOKUP(E470,'Časy cíl'!$B$2:$C$252,2,FALSE))","v":""},"",123,{"$f":"VLOOKUP(C470,'Kategorie - UPRAV ROK!'!$A$18:$C$21,3,FALSE)","v":{"$error":"#N/A"}}]
[{"$nulls":3},{"$f":"IF(B471=\"\",\"\",VLOOKUP('Kategorie - UPRAV ROK!'!$B$1-B471,'Kategorie - UPRAV ROK!'!$A$5:$G$13,OFFSET(B471,0,9)+3,TRUE))","v":""},null,null,"10:00:00",{"$f":"IF(ISERROR(VLOOKUP(E471,'Časy cíl'!$B$2:$C$252,2,FALSE)),\"\",VLOOKUP(E471,'Časy cíl'!$B$2:$C$252,2,FALSE))","v":""},"",124,{"$f":"VLOOKUP(C471,'Kategorie - UPRAV ROK!'!$A$18:$C$21,3,FALSE)","v":{"$error":"#N/A"}}]
[{"$nulls":3},{"$f":"IF(B472=\"\",\"\",VLOOKUP('Kategorie - UPRAV ROK!'!$B$1-B472,'Kategorie - UPRAV ROK!'!$A$5:$G$13,OFFSET(B472,0,9)+3,TRUE))","v":""},null,null,"10:00:00",{"$f":"IF(ISERROR(VLOOKUP(E472,'Časy cíl'!$B$2:$C$252,2,FALSE)),\"\",VLOOKUP(E472,'Časy cíl'!$B$2:$C$252,2,FALSE))","v":""},"",125,{"$f":"VLOOKUP(C472,'Kategorie - UPRAV ROK!'!$A$18:$C$21,3,FALSE)","v":{"$error":"#N/A"}}]
[{"$nulls":3},{"$f":"IF(B473=\"\",\"\",VLOOKUP('Kategorie - UPRAV ROK!'!$B$1-B473,'Kategorie - UPRAV ROK!'!$A$5:$G$13,OFFSET(B473,0,9)+3,TRUE))","v":""},null,null,"10:00:00",{"$f":"IF(ISERROR(VLOOKUP(E473,'Časy cíl'!$B$2:$C$252,2,FALSE)),\"\",VLOOKUP(E473,'Časy cíl'!$B$2:$C$252,2,FALSE))","v":""},"",126,{"$f":"VLOOKUP(C473,'Kategorie - UPRAV ROK!'!$A$18:$C$21,3,FALSE)","v":{"$error":"#N/A"}}]
[{"$nulls":3},{"$f":"IF(B474=\"\",\"\",VLOOKUP('Kategorie - UPRAV ROK!'!$B$1-B474,'Kategorie - UPRAV ROK!'!$A$5:$G$13,OFFSET(B474,0,9)+3,TRUE))","v":""},null,null,"10:00:00",{"$f":"IF(ISERROR(VLOOKUP(E474,'Časy cíl'!$B$2:$C$252,2,FALSE)),\"\",VLOOKUP(E474,'Časy cíl'!$B$2:$C$252,2,FALSE))","v":""},"",127,{"$f":"VLOOKUP(C474,'Kategorie - UPRAV ROK!'!$A$18:$C$21,3,FALSE)","v":{"$error":"#N/A"}}]
[{"$nulls":3},{"$f":"IF(B475=\"\",\"\",VLOOKUP('Kategorie - UPRAV ROK!'!$B$1-B475,'Kategorie - UPRAV ROK!'!$A$5:$G$13,OFFSET(B475,0,9)+3,TRUE))","v":""},null,null,"10:00:00",{"$f":"IF(ISERROR(VLOOKUP(E475,'Časy cíl'!$B$2:$C$252,2,FALSE)),\"\",VLOOKUP(E475,'Časy cíl'!$B$2:$C$252,2,FALSE))","v":""},"",128,{"$f":"VLOOKUP(C475,'Kategorie - UPRAV ROK!'!$A$18:$C$21,3,FALSE)","v":{"$error":"#N/A"}}]
[{"$nulls":3},{"$f":"IF(B476=\"\",\"\",VLOOKUP('Kategorie - UPRAV ROK!'!$B$1-B476,'Kategorie - UPRAV ROK!'!$A$5:$G$13,OFFSET(B476,0,9)+3,TRUE))","v":""},null,null,"10:00:00",{"$f":"IF(ISERROR(VLOOKUP(E476,'Časy cíl'!$B$2:$C$252,2,FALSE)),\"\",VLOOKUP(E476,'Časy cíl'!$B$2:$C$252,2,FALSE))","v":""},"",129,{"$f":"VLOOKUP(C476,'Kategorie - UPRAV ROK!'!$A$18:$C$21,3,FALSE)","v":{"$error":"#N/A"}}]
[{"$nulls":3},{"$f":"IF(B477=\"\",\"\",VLOOKUP('Kategorie - UPRAV ROK!'!$B$1-B477,'Kategorie - UPRAV ROK!'!$A$5:$G$13,OFFSET(B477,0,9)+3,TRUE))","v":""},null,null,"10:00:00",{"$f":"IF(ISERROR(VLOOKUP(E477,'Časy cíl'!$B$2:$C$252,2,FALSE)),\"\",VLOOKUP(E477,'Časy cíl'!$B$2:$C$252,2,FALSE))","v":""},"",130,{"$f":"VLOOKUP(C477,'Kategorie - UPRAV ROK!'!$A$18:$C$21,3,FALSE)","v":{"$error":"#N/A"}}]
[{"$nulls":3},{"$f":"IF(B478=\"\",\"\",VLOOKUP('Kategorie - UPRAV ROK!'!$B$1-B478,'Kategorie - UPRAV ROK!'!$A$5:$G$13,OFFSET(B478,0,9)+3,TRUE))","v":""},null,null,"10:00:00",{"$f":"IF(ISERROR(VLOOKUP(E478,'Časy cíl'!$B$2:$C$252,2,FALSE)),\"\",VLOOKUP(E478,'Časy cíl'!$B$2:$C$252,2,FALSE))","v":""},"",131,{"$f":"VLOOKUP(C478,'Kategorie - UPRAV ROK!'!$A$18:$C$21,3,FALSE)","v":{"$error":"#N/A"}}]
[{"$nulls":3},{"$f":"IF(B479=\"\",\"\",VLOOKUP('Kategorie - UPRAV ROK!'!$B$1-B479,'Kategorie - UPRAV ROK!'!$A$5:$G$13,OFFSET(B479,0,9)+3,TRUE))","v":""},null,null,"10:00:00",{"$f":"IF(ISERROR(VLOOKUP(E479,'Časy cíl'!$B$2:$C$252,2,FALSE)),\"\",VLOOKUP(E479,'Časy cíl'!$B$2:$C$252,2,FALSE))","v":""},"",132,{"$f":"VLOOKUP(C479,'Kategorie - UPRAV ROK!'!$A$18:$C$21,3,FALSE)","v":{"$error":"#N/A"}}]
[{"$nulls":3},{"$f":"IF(B480=\"\",\"\",VLOOKUP('Kategorie - UPRAV ROK!'!$B$1-B480,'Kategorie - UPRAV ROK!'!$A$5:$G$13,OFFSET(B480,0,9)+3,TRUE))","v":""},null,null,"10:00:00",{"$f":"IF(ISERROR(VLOOKUP(E480,'Časy cíl'!$B$2:$C$252,2,FALSE)),\"\",VLOOKUP(E480,'Časy cíl'!$B$2:$C$252,2,FALSE))","v":""},"",133,{"$f":"VLOOKUP(C480,'Kategorie - UPRAV ROK!'!$A$18:$C$21,3,FALSE)","v":{"$error":"#N/A"}}]
[{"$nulls":3},{"$f":"IF(B481=\"\",\"\",VLOOKUP('Kategorie - UPRAV ROK!'!$B$1-B481,'Kategorie - UPRAV ROK!'!$A$5:$G$13,OFFSET(B481,0,9)+3,TRUE))","v":""},null,null,"10:00:00",{"$f":"IF(ISERROR(VLOOKUP(E481,'Časy cíl'!$B$2:$C$252,2,FALSE)),\"\",VLOOKUP(E481,'Časy cíl'!$B$2:$C$252,2,FALSE))","v":""},"",134,{"$f":"VLOOKUP(C481,'Kategorie - UPRAV ROK!'!$A$18:$C$21,3,FALSE)","v":{"$error":"#N/A"}}]

{"sheet":"Kategorie - UPRAV ROK!","index":1,"n_rows":28,"n_cols":7,"rows_kept":28}
["ROK",2026,"<--- Upravit!!!"]
[]
[]
["Věk","Spodní hranice - ročník - počítá se samo","Horní hranice - ročník - počítá se samo","M","Z","HM","HZ"]
[0,{"$f":"$B$1-A5","v":2026},{"$f":"$B$1-A6+1","v":2022},"1 - NADĚJE","1 - NADĚJE","1 - NADĚJE","1 - NADĚJE"]
[5,2021,{"$f":"$B$1-A7+1","v":2020},"2 - PŘEDŽÁCI","2 - PŘEDŽÁCI","2 - PŘEDŽÁCI","2 - PŘEDŽÁCI"]
[7,2019,2018,"3 - MLADŠÍ ŽÁCI","3 - MLADŠÍ ŽÁCI - DÍVKY","3 - MLADŠÍ ŽÁCI","3 - MLADŠÍ ŽÁCI - DÍVKY"]
[9,2017,2016,"4 - ŽÁCI","4 - ŽÁCI - DÍVKY","4 - ŽÁCI","4 - ŽÁCI - DÍVKY"]
[11,2015,2014,"5 - STARŠÍ ŽÁCI","5 - STARŠÍ ŽÁCI - DÍVKY","5 - STARŠÍ ŽÁCI","5 - STARŠÍ ŽÁCI - DÍVKY"]
[13,2013,2012,"6 - MLADŠÍ DOROST","6 - MLADŠÍ DOROST - DÍVKY","6 - MLADŠÍ DOROST","6 - MLADŠÍ DOROST - DÍVKY"]
[15,2011,2009,"7 - STARŠÍ DOROST","7 - STARŠÍ DOROST - DÍVKY","7 - STARŠÍ DOROST","7 - STARŠÍ DOROST - DÍVKY"]
[18,2008,1986,"8 - DOSPĚLÍ","8 - DOSPĚLAČKY","X - HOROLEZCI","X - HOROLEZKYNĚ"]
[41,1985,"a starší","9 - VETERÁNI","9 - VETERÁNKY","XI - HOROLEZCI VETERÁNI","XI - HOROLEZKYNĚ VETERÁNKY"]
[]
[]
[]
[]
["m","muži / chlapci",1,{"$f":"CONCATENATE(\"1. do \",C5,\"   NADĚJE\")","v":"1. do 2022   NADĚJE"}]
["z","ženy / dívky",2,{"$f":"CONCATENATE(\"2. \",C6,\" - \",B6,\"   PŘEDŽÁCI\")","v":"2. 2020 - 2021   PŘEDŽÁCI"}]
["hm","horolezci",3,{"$f":"CONCATENATE(\"3. \",C7,\" - \",B7,\"   MLADŠÍ ŽÁCI\")","v":"3. 2018 - 2019   MLADŠÍ ŽÁCI"}]
["hz","horolezkyně",4,{"$f":"CONCATENATE(\"4. \",C8,\" - \",B8,\"   ŽÁCI\")","v":"4. 2016 - 2017   ŽÁCI"}]
[{"$nulls":3},{"$f":"CONCATENATE(\"5. \",C9,\" - \",B9,\"   STARŠÍ ŽÁCI\")","v":"5. 2014 - 2015   STARŠÍ ŽÁCI"}]
[{"$nulls":3},{"$f":"CONCATENATE(\"6. \",C10,\" - \",B10,\"   MLADŠÍ DOROST\")","v":"6. 2012 - 2013   MLADŠÍ DOROST"}]
[{"$nulls":3},{"$f":"CONCATENATE(\"7. \",C11,\" - \",B11,\"   STARŠÍ DOROST\")","v":"7. 2009 - 2011   STARŠÍ DOROST"}]
[{"$nulls":3},{"$f":"CONCATENATE(\"8. \",C12,\" - \",B12,\"   DOSPĚLÍ\")","v":"8. 1986 - 2008   DOSPĚLÍ"}]
[{"$nulls":3},{"$f":"CONCATENATE(\"9. \",B13,\" - \",C13,\"   VETERÁNI\")","v":"9. 1985 - a starší   VETERÁNI"}]
[{"$nulls":3},{"$f":"CONCATENATE(\"10. \",C12,\" - \",B12,\"   HOROLEZCI\")","v":"10. 1986 - 2008   HOROLEZCI"}]
[{"$nulls":3},{"$f":"CONCATENATE(\"11. \",B13,\" - \",C13,\"   HOROLEZCI VETERÁNI\")","v":"11. 1985 - a starší   HOROLEZCI VETERÁNI"}]

{"sheet":"Pokyny","index":2,"n_rows":23,"n_cols":2,"rows_kept":23}
[]
["Příprava ročníku"]
["1. Uprav rok - v listu \"Kategorie - UPRAV ROK!\""]
[null,"Tím se přepíše seznam kategorií na listu se startovkou, přepíší se data pro vzorec pro přiřazení kategorie"]
["2. Navkládej do tabulky nad startovkou co nejvíce jmen z minulých ročníků. Řádky musí být za sebou bez prázdných řádků. Tenhle seznam bude fungovat jako našeptávač při zadávání jmen na prezentaci "]
[]
["Prezentace"]
["1. Zadávej startovku"]
["2. Výběr dat pro seřazení: Kurzor do první buňky, Ctrl + Shift + šipka dolů, Ctrl + Shift + šipka vpravo (vybere se celá oblast se strartovkou i připravenýmy výpočty pro časy"]
[]
["Start"]
["Časy startu je možné zadávat v minutách. Starty nad 60min je potřeba zadávat např. 61, 62, …"]
["Zadat čas startu v hodinách na listu se startovkou"]
[]
["Zadávání časů cíle"]
["1. varianta - ručně"]
["Časy cíle zadávat jako    minuty, čárka, sekundy     (např. 10,45 - to znamená 10 minut a 45 sekund)"]
[null,"pokud je to nad hodinu, zadávat např. jako 65,45"]
[null,"Je to logický nesmysl, ale dobře se to zadává a čas dál je upravený tak, že to takto funguje ;-)"]
[]
["2. varianta - ze souboru"]
[null,"Nahrát data z cíle do listu Časy cíl"]
[null,"Další pokyny jsou v tom listu"]

{"sheet":"Časy cíl","index":3,"n_rows":252,"n_cols":14,"rows_kept":252}
["Pořadí doběhu","Startovní číslo","Čas doběhu","Poznámka - např. navíc zadaný čas - napiš Chyba nebo jinou poznámku","Kontrola, každé st. číslo je jednou",{"$nulls":8},"Pokyny"]
[null,1,"10:18:24",{"$nulls":10},"Sem nakopírovat dat z cíle"]
[null,2,"10:10:09",null,{"$f":"IF(B3=\"\",\"\",B3-B2)","v":1},{"$nulls":8},"Zkontrolovat, jestli ve sloupci chyba není nějaká poznámka případně ji opravit - např. smazat nebo doplnit řádek"]
[null,3,"10:07:21",null,1,{"$nulls":8},"Seřadit podle startovního čísla"]
[null,4,"10:17:49",null,1,{"$nulls":8},"Zkontrolovat, jestli se nějaké startovní číslo neopakuje - ve sloupci E nesmí být hodnota 0"]
[null,5,"10:10:30",null,{"$f":"IF(B6=\"\",\"\",B6-B5)","v":1}]
[null,6,"10:15:40",null,{"$f":"IF(B7=\"\",\"\",B7-B6)","v":1}]
[null,7,"10:08:14",null,1]
[null,8,"10:09:14",null,1]
[null,9,"10:09:40",null,1]
[null,10,"10:11:58",null,1]
[null,11,"10:11:35",null,1]
[null,12,"10:10:22",null,1]
[null,13,"10:13:13",null,1]
[null,14,"10:10:46",null,1]
[null,15,"10:11:44",null,1]
[null,16,"10:10:35",null,1]
[null,17,"10:12:08",null,1]
[null,18,"10:11:59",null,1]
[null,19,"10:12:21",null,1]
[null,20,"10:13:23",null,1]
[null,21,"10:15:01",null,1]
[null,22,"10:13:28",null,1]
[null,23,"10:15:41",null,1]
[null,24,"10:15:18",null,1]
[null,25,"10:16:55",null,1]
[null,26,"10:15:46",null,1]
[null,27,"10:15:57",null,1]
[null,28,"10:16:40",null,1]
[null,29,"10:15:49",null,1]
[null,30,"10:17:52",null,1]
[null,31,"10:17:48",null,1]
[null,32,"10:19:07",null,1]
[null,33,"10:19:36",null,1]
[null,34,"10:20:01",null,1]
[null,35,"10:19:52",null,1]
[null,36,"10:21:00",null,1]
[null,37,"10:21:02",null,1]
[null,38,"10:21:59",null,1]
[null,39,"10:20:28",null,1]
[null,40,"10:21:52",null,1]
[null,41,"10:21:41",null,1]
[null,42,"10:21:47",null,1]
[null,43,"10:25:00",null,1]
[null,44,"10:23:22",null,1]
[null,45,"10:23:26",null,1]
[null,46,"10:24:10",null,1]
[null,47,"10:23:34",null,1]
[null,48,"10:24:37",null,1]
[null,49,"10:24:19",null,1]
[null,50,"10:25:28",null,1]
[null,51,"10:25:52",null,1]
[null,52,"10:26:23",null,1]
[null,53,"10:26:11",null,1]
[null,54,"10:26:15",null,1]
[null,55,"10:29:27",null,1]
[null,56,"10:27:54",null,1]
[null,57,"10:30:21",null,1]
[null,58,"10:30:39",null,1]
[null,59,"10:32:02",null,1]
[null,60,"10:31:20",null,1]
[null,61,"10:37:05",null,1]
[null,62,"10:31:02",null,1]
[null,63,"10:30:51",null,1]
[null,64,"10:32:04",null,1]
[null,65,"10:32:13",null,1]
[null,66,"10:33:16",null,1]
[null,67,"10:32:26",null,1]
[null,68,"10:32:54",null,1]
[null,69,"10:34:01",null,1]
[null,70,"10:34:31",null,{"$f":"IF(B71=\"\",\"\",B71-B70)","v":1}]
[null,71,"10:34:12",null,1]
[null,72,"10:36:38",null,1]
[null,73,"10:35:38",null,1]
[null,74,"10:36:06",null,1]
[null,75,"10:37:07",null,1]
[null,76,"10:37:34",null,1]
[null,77,"10:37:13",null,1]
[null,78,"10:03:32",null,1]
[null,79,"10:39:19",null,1]
[null,80,"10:40:08",null,1]
[null,81,"10:39:28",null,1]
[null,82,"10:41:24",null,1]
[null,83,"10:41:05",null,1]
[null,84,"10:45:42",null,1]
[null,85,"10:41:50",null,1]
[null,86,"10:41:52",null,1]
[null,87,"10:42:51",null,1]
[null,88,"10:42:39",null,1]
[null,89,"10:44:12",null,1]
[null,90,"10:52:16",null,1]
[null,91,"10:45:14",null,1]
[null,92,"10:47:06",null,1]
[null,93,"10:46:41",null,1]
[null,94,"10:45:30",null,1]
[null,95,"10:48:49",null,1]
[null,96,"10:49:05",null,1]
[null,97,"10:48:14",null,1]
[null,98,"10:49:34",null,1]
[null,99,"10:49:09",null,1]
[null,100,"10:03:21",null,1]
[null,101,"10:46:13",null,1]
[null,151,"10:48:04",null,50]
[{"$nulls":4},""]
[{"$nulls":4},""]
[{"$nulls":4},""]
[{"$nulls":4},""]
[{"$nulls":4},""]
[{"$nulls":4},""]
[{"$nulls":4},""]
[{"$nulls":4},""]
[{"$nulls":4},""]
[{"$nulls":4},""]
[{"$nulls":4},""]
[{"$nulls":4},""]
[{"$nulls":4},""]
[{"$nulls":4},""]
[{"$nulls":4},""]
[{"$nulls":4},""]
[{"$nulls":4},""]
[{"$nulls":4},""]
[{"$nulls":4},""]
[{"$nulls":4},""]
[{"$nulls":4},""]
[{"$nulls":4},""]
[{"$nulls":4},""]
[{"$nulls":4},""]
[{"$nulls":4},""]
[{"$nulls":4},""]
[{"$nulls":4},""]
[{"$nulls":4},""]
[{"$nulls":4},""]
[{"$nulls":4},""]
[{"$nulls":4},""]
[{"$nulls":4},{"$f":"IF(B135=\"\",\"\",B135-B134)","v":""}]
[{"$nulls":4},""]
[{"$nulls":4},""]
[{"$nulls":4},""]
[{"$nulls":4},""]
[{"$nulls":4},""]
[{"$nulls":4},""]
[{"$nulls":4},""]
[{"$nulls":4},""]
[{"$nulls":4},""]
[{"$nulls":4},""]
[{"$nulls":4},""]
[{"$nulls":4},""]
[{"$nulls":4},""]
[{"$nulls":4},""]
[{"$nulls":4},""]
[{"$nulls":4},""]
[{"$nulls":4},""]
[{"$nulls":4},""]
[{"$nulls":4},""]
[{"$nulls":4},""]
[{"$nulls":4},""]
[{"$nulls":4},""]
[{"$nulls":4},""]
[{"$nulls":4},""]
[{"$nulls":4},""]
[{"$nulls":4},""]
[{"$nulls":4},""]
[{"$nulls":4},""]
[{"$nulls":4},""]
[{"$nulls":4},""]
[{"$nulls":4},""]
[{"$nulls":4},""]
[{"$nulls":4},""]
[{"$nulls":4},""]
[{"$nulls":4},""]
[{"$nulls":4},""]
[{"$nulls":4},""]
[{"$nulls":4},""]
[{"$nulls":4},""]
[{"$nulls":4},""]
[{"$nulls":4},""]
[{"$nulls":4},""]
[{"$nulls":4},""]
[{"$nulls":4},""]
[{"$nulls":4},""]
[{"$nulls":4},""]
[{"$nulls":4},""]
[{"$nulls":4},""]
[{"$nulls":4},""]
[{"$nulls":4},""]
[{"$nulls":4},""]
[{"$nulls":4},""]
[{"$nulls":4},""]
[{"$nulls":4},""]
[{"$nulls":4},""]
[{"$nulls":4},""]
[{"$nulls":4},""]
[{"$nulls":4},""]
[{"$nulls":4},""]
[{"$nulls":4},""]
[{"$nulls":4},""]
[{"$nulls":4},""]
[{"$nulls":4},""]
[{"$nulls":4},{"$f":"IF(B199=\"\",\"\",B199-B198)","v":""}]
[{"$nulls":4},""]
[{"$nulls":4},""]
[{"$nulls":4},""]
[{"$nulls":4},""]
[{"$nulls":4},""]
[{"$nulls":4},""]
[{"$nulls":4},""]
[{"$nulls":4},""]
[{"$nulls":4},""]
[{"$nulls":4},""]
[{"$nulls":4},""]
[{"$nulls":4},""]
[{"$nulls":4},""]
[{"$nulls":4},""]
[{"$nulls":4},""]
[{"$nulls":4},""]
[{"$nulls":4},""]
[{"$nulls":4},""]
[{"$nulls":4},""]
[{"$nulls":4},""]
[{"$nulls":4},""]
[{"$nulls":4},""]
[{"$nulls":4},""]
[{"$nulls":4},""]
[{"$nulls":4},""]
[{"$nulls":4},""]
[{"$nulls":4},""]
[{"$nulls":4},""]
[{"$nulls":4},""]
[{"$nulls":4},""]
[{"$nulls":4},""]
[{"$nulls":4},""]
[{"$nulls":4},""]
[{"$nulls":4},""]
[{"$nulls":4},""]
[{"$nulls":4},""]
[{"$nulls":4},""]
[{"$nulls":4},""]
[{"$nulls":4},""]
[{"$nulls":4},""]
[{"$nulls":4},""]
[{"$nulls":4},""]
[{"$nulls":4},""]
[{"$nulls":4},""]
[{"$nulls":4},""]
[{"$nulls":4},""]
[{"$nulls":4},""]
[{"$nulls":4},""]
[{"$nulls":4},""]
[{"$nulls":4},""]
[{"$nulls":4},""]
[{"$nulls":4},""]
[{"$nulls":4},""]